{"text_format":"1","workbook":"xlsx","n_sheets":6,"sheets":["RefParts II","RefParts","Fornecedores II","CP10.2024","Fornecedores","Input"],"not_rendered":{"charts":0,"images":1,"macros":1,"external_links":0,"defined_names":3,"comments":0,"pivot_tables":0},"unopened":[],"bounds":{"document_bytes":16777216,"sheet_cells":100000,"rows_first":2000,"rows_last":500,"rows_between":2000,"halvings":0,"cell_chars":16384,"cell_head_chars":4096},"cells_cut":0,"cells_raw":0,"read":"whole","date_system":"1900"}

{"sheet":"RefParts II","index":0,"n_rows":125,"n_cols":12,"rows_kept":125,"cut":false,"hidden":false,"merged":[]}
["Ref Acordo","Nome Acordo","Empresa","Descrição Peça","CAE","Fornecedor","CFE","Marca Modelo","VUnit","Acordo","Data I","Data F"]
["CP10.2024.00001","CP10.2024: Parabrisas","BT","Parabrisas","002133031.10","NASACAR","20082.10","STARGLASS: 0809497/22540",608,"Acordo","2025-01-20","2026-01-20"]
["CP10.2024.00001","CP10.2024: Parabrisas","BT","Parabrisas","002133031.10","EXPRESSGLASS","17910.10","Pilkington: 632 671 19 10",774.1,"Alternativa 1","2025-01-20","2026-01-20"]
["CP10.2024.00001","CP10.2024: Parabrisas","BT","Parabrisas","002133031.10","CBM","30052.10","MB: A6326711910",980,"Alternativa 2","2025-01-20","2026-01-20"]
["CP10.2024.00002","CP10.2024: Parabrisas","BT","Parabrisas","002133635.10","NASACAR","20082.10","STARGLASS: 0820450/22250",802,"Acordo","2025-01-20","2026-01-20"]
["CP10.2024.00002","CP10.2024: Parabrisas","BT","Parabrisas","002133635.10","EXPRESSGLASS","17910.10","Pilkington: 632 670 15 01",842.3,"Alternativa 1","2025-01-20","2026-01-20"]
["CP10.2024.00002","CP10.2024: Parabrisas","BT","Parabrisas","002133635.10","CBM","30052.10","Pilkington: D9502084",868,"Alternativa 2","2025-01-20","2026-01-20"]
["CP10.2024.00003","CP10.2024: Parabrisas","BT","Parabrisas","002134013.10","NASACAR","20082.10","TERGLASS: 0834242/22540",810,"Acordo","2025-01-20","2026-01-20"]
["CP10.2024.00003","CP10.2024: Parabrisas","BT","Parabrisas","002134013.10","CBM","30052.10","finnlamex: D9413654",994,"Alternativa 1","2025-01-20","2026-01-20"]
["CP10.2024.00003","CP10.2024: Parabrisas","BT","Parabrisas","002134013.10","EXPRESSGLASS","17910.10","Pilkington: 410 670 40 01",1144.3,"Alternativa 2","2025-01-20","2026-01-20"]
["CP10.2024.00004","CP10.2024: Parabrisas","BT","Parabrisas","002132678.10","NASACAR","20082.10","STARGLASS: 0809136/22540",480,"Acordo","2025-01-20","2026-01-20"]
["CP10.2024.00004","CP10.2024: Parabrisas","BT","Parabrisas","002132678.10","CBM","30052.10","finnlamex: D9403411",599.20000000000005,"Alternativa 1","2025-01-20","2026-01-20"]
["CP10.2024.00004","CP10.2024: Parabrisas","BT","Parabrisas","002132678.10","EXPRESSGLASS","17910.10","Pilkington: 592009",826.9,"Alternativa 2","2025-01-20","2026-01-20"]
["CP10.2024.00005","CP10.2024: Parabrisas","BT","Parabrisas","002133809.10","NASACAR","20082.10","STARGLASS: 0833073/22540",810,"Acordo","2025-01-20","2026-01-20"]
["CP10.2024.00005","CP10.2024: Parabrisas","BT","Parabrisas","002133809.10","EXPRESSGLASS","17910.10","Pilkington: 410 670 16 01",1037,"Alternativa 1","2025-01-20","2026-01-20"]
["CP10.2024.00005","CP10.2024: Parabrisas","BT","Parabrisas","002133809.10","CBM","30052.10","MB: A4106701601",1330,"Alternativa 2","2025-01-20","2026-01-20"]
["CP10.2024.00006","CP10.2024: Parabrisas","BT","Parabrisas","002132637.10","NASACAR","20082.10","STARGLASS: 0809289/22540",665,"Acordo","2025-01-20","2026-01-20"]
["CP10.2024.00007","CP10.2024: Parabrisas","BT","Parabrisas","002157147.10","NASACAR","20082.10","STARGLASS: 0834562/22540",755,"Acordo","2025-01-20","2026-01-20"]
["CP10.2024.00007","CP10.2024: Parabrisas","BT","Parabrisas","002157147.10","CBM","30052.10","finnlamex: D9413144",770,"Alternativa 1","2025-01-20","2026-01-20"]
["CP10.2024.00007","CP10.2024: Parabrisas","BT","Parabrisas","002157147.10","EXPRESSGLASS","17910.10","Pilkington: 410 670 63 01",924.1,"Alternativa 2","2025-01-20","2026-01-20"]
["CP10.2024.00007","CP10.2024: Parabrisas","BT","Parabrisas","002134195.10","NASACAR","20082.10","STARGLASS: 0834562/22540",755,"Acordo","2025-01-20","2026-01-20"]
["CP10.2024.00007","CP10.2024: Parabrisas","BT","Parabrisas","002134195.10","CBM","30052.10","finnlamex: D9413144",770,"Alternativa 1","2025-01-20","2026-01-20"]
["CP10.2024.00007","CP10.2024: Parabrisas","BT","Parabrisas","002134195.10","EXPRESSGLASS","17910.10","Pilkington: 410 670 63 01",924.1,"Alternativa 2","2025-01-20","2026-01-20"]
["CP10.2024.00008","CP10.2024: Parabrisas","BT","Parabrisas","002133619.10","NASACAR","20082.10","STARGLASS: 0809207/22540",660,"Acordo","2025-01-20","2026-01-20"]
["CP10.2024.00008","CP10.2024: Parabrisas","BT","Parabrisas","002133619.10","CBM","30052.10","Pilkington: D94094038",660,"Alternativa 1","2025-01-20","2026-01-20"]
["CP10.2024.00009","CP10.2024: Parabrisas","BT","Parabrisas","002133585.10","NASACAR","20082.10","STARGLASS: 0820390/22540",750,"Acordo","2025-01-20","2026-01-20"]
["CP10.2024.00009","CP10.2024: Parabrisas","BT","Parabrisas","002133585.10","CBM","30052.10","Pilkington: D9390240",805,"Alternativa 1","2025-01-20","2026-01-20"]
["CP10.2024.00009","CP10.2024: Parabrisas","BT","Parabrisas","002133585.10","EXPRESSGLASS","17910.10","Pilkington: 633 671 00 10",833.3,"Alternativa 2","2025-01-20","2026-01-20"]
["CP10.2024.00010","CP10.2024: Parabrisas","BT","Parabrisas","002132611.10","NASACAR","20082.10","STRAGLASS: 0809056/22540",700,"Acordo","2025-01-20","2026-01-20"]
["CP10.2024.00010","CP10.2024: Parabrisas","BT","Parabrisas","002132611.10","CBM","30052.10","Pilkington: D9390240",860,"Alternativa 1","2025-01-20","2026-01-20"]
["CP10.2024.00010","CP10.2024: Parabrisas","BT","Parabrisas","002132611.10","EXPRESSGLASS","17910.10","Pilkington: 632 671 00 10",1116.7,"Alternativa 2","2025-01-20","2026-01-20"]
["CP10.2024.00011","CP10.2024: Parabrisas","BT","Parabrisas","002133270.10","NASACAR","20082.10","STRAGLASS: 0809266/22540",715,"Acordo","2025-01-20","2026-01-20"]
["CP10.2024.00011","CP10.2024: Parabrisas","BT","Parabrisas","002133270.10","CBM","30052.10","finnlamex: D9403599",749.5,"Alternativa 1","2025-01-20","2026-01-20"]
["CP10.2024.00011","CP10.2024: Parabrisas","BT","Parabrisas","002133270.10","EXPRESSGLASS","17910.10","Pilkington: 592414",883.3,"Alternativa 2","2025-01-20","2026-01-20"]
["CP10.2024.00013","CP10.2024: Parabrisas","BT","Parabrisas","002133288.10","CBM","30052.10","finnlamex: D9404361",617.4,"Acordo","2025-01-20","2026-01-20"]
["CP10.2024.00013","CP10.2024: Parabrisas","BT","Parabrisas","002133288.10","NASACAR","20082.10","STRAGLASS: 0801647/22540",645,"Alternativa 1","2025-01-20","2026-01-20"]
["CP10.2024.00014","CP10.2024: Parabrisas","BT","Parabrisas","002131134.10","CBM","30052.10","Pilkington: D9297005",660,"Acordo","2025-01-20","2026-01-20"]
["CP10.2024.00014","CP10.2024: Parabrisas","BT","Parabrisas","002131134.10","NASACAR","20082.10","STRAGLASS: 0811052/22540",798,"Alternativa 1","2025-01-20","2026-01-20"]
["CP10.2024.00014","CP10.2024: Parabrisas","BT","Parabrisas","002131134.10","EXPRESSGLASS","17910.10","Pilkington: 88751010902",911.7,"Alternativa 2","2025-01-20","2026-01-20"]
["CP10.2024.00015","CP10.2024: Parabrisas","BT","Parabrisas","002157220.10","CBM","30052.10","MERCEDES: A4106705510",1550,"Acordo","2025-01-20","2026-01-20"]
["CP10.2024.00016","CP10.2024: Parabrisas","BT","Parabrisas","002133593.10",null,null,": ",null,"Acordo","2025-01-20","2026-01-20"]
["CP10.2024.00019","CP10.2024: Parabrisas","BT","Parabrisas","002132900.10","NASACAR","20082.10","SAINT-GOBAIN: 0809466/167",1190,"Acordo","2025-01-20","2026-01-20"]
["CP10.2024.00019","CP10.2024: Parabrisas","BT","Parabrisas","002132900.10","CBM","30052.10","MERCEDES: A6326710310",1480,"Alternativa 1","2025-01-20","2026-01-20"]
["CP10.2024.00019","CP10.2024: Parabrisas","BT","Parabrisas","002132900.10","EXPRESSGLASS","17910.10","Pilkington: 632 671 03 10",1566.7,"Alternativa 2","2025-01-20","2026-01-20"]
["CP10.2024.00021","CP10.2024: Parabrisas","BT","Parabrisas","004592275.10","CBM","30052.10","finnlamex: D9404591",465,"Acordo","2025-01-20","2026-01-20"]
["CP10.2024.00021","CP10.2024: Parabrisas","BT","Parabrisas","004592275.10","NASACAR","20082.10","TERGLASS: 0823026/33191",710,"Alternativa 1","2025-01-20","2026-01-20"]
["CP10.2024.00023","CP10.2024: Parabrisas","BT","Oculo Traseiro","002157113.10","CBM","30052.10","MERCEDES: D9414252",700.5,"Acordo","2025-01-20","2026-01-20"]
["CP10.2024.00024","CP10.2024: Parabrisas","BT","Oculo Traseiro","002133098.10","EXPRESSGLASS","17910.10","Pilkington: 633 678 00 10",336.1,"Acordo","2025-01-20","2026-01-20"]
["CP10.2024.00024","CP10.2024: Parabrisas","BT","Oculo Traseiro","002133098.10","NASACAR","20082.10","TERGLASS: 0828050/33191",460,"Alternativa 1","2025-01-20","2026-01-20"]
["CP10.2024.00024","CP10.2024: Parabrisas","BT","Oculo Traseiro","002133098.10","CBM","30052.10","MB: D9392246",720.3,"Alternativa 2","2025-01-20","2026-01-20"]
["CP10.2024.00028","CP10.2024: Parabrisas","BT","Vidro janela motorista","002153740.10","CBM","30052.10","CBM PART: D9413599",554,"Acordo","2025-01-20","2026-01-20"]
["CP10.2024.00029","CP10.2024: Parabrisas","BT","Vidro lateral","002134088.10",null,null,": ",null,"Acordo","2025-01-20","2026-01-20"]
["CP10.2024.00030","CP10.2024: Parabrisas","BT","Vidro lateral","002155596.10","CBM","30052.10","CBM PART: D9411173",748,"Acordo","2025-01-20","2026-01-20"]
["CP10.2024.00031","CP10.2024: Parabrisas","BT","Vidro lateral","002155968.10",null,null,": ",null,"Acordo","2025-01-20","2026-01-20"]
["CP10.2024.00032","CP10.2024: Parabrisas","BT","vidro porta","004596037.10","CBM","30052.10","SAINT G: D9297535",490,"Acordo","2025-01-20","2026-01-20"]
["CP10.2024.00033","CP10.2024: Parabrisas","BT","vidro porta","002155778.10","NASACAR","20082.10","VITROPOR: 0823130/1135",288,"Acordo","2025-01-20","2026-01-20"]
["CP10.2024.00033","CP10.2024: Parabrisas","BT","vidro porta","002155778.10","CBM","30052.10","SAINT G: D9297536",620,"Alternativa 1","2025-01-20","2026-01-20"]
["CP10.2024.00034","CP10.2024: Parabrisas","BT","vidro porta","002143022.10","CBM","30052.10","MERCEDES: A6446734406",490,"Acordo","2025-01-20","2026-01-20"]
["CP10.2024.00035","CP10.2024: Parabrisas","BT","vidro porta","002157139.10","CBM","30052.10","MERCEDES: A4107351110",290,"Acordo","2025-01-20","2026-01-20"]
["CP10.2024.00007","CP10.2024: Parabrisas","RL","Parabrisas","002133031.16","NASACAR"," 06657 .16","STARGLASS: 0834562/22540",755,"Acordo","2025-01-20","2026-01-20"]
["CP10.2024.00007","CP10.2024: Parabrisas","RL","Parabrisas","002133031.16","CBM","09403 .16","finnlamex: D9413144",770,"Alternativa 1","2025-01-20","2026-01-20"]
["CP10.2024.00007","CP10.2024: Parabrisas","RL","Parabrisas","002133031.16","EXPRESSGLASS","02143.16","Pilkington: 410 670 63 01",924.1,"Alternativa 2","2025-01-20","2026-01-20"]
["CP10.2024.00023","CP10.2024: Parabrisas","RL","Oculo Traseiro","002133056.16","CBM","09403 .16","MERCEDES: D9414252",700.5,"Acordo","2025-01-20","2026-01-20"]
["CP10.2024.00026","CP10.2024: Parabrisas","RL","Vidro divisoria interior","002163178.16","CBM","09403 .16","MERCEDES: A3947111710",490,"Acordo","2025-01-20","2026-01-20"]
["CP10.2024.00027","CP10.2024: Parabrisas","RL","Vidro janela motorista","002163061.16","CBM","09403 .16","MERCEDES: A3116708411",1690,"Acordo","2025-01-20","2026-01-20"]
["CP10.2024.00001","CP10.2024: Parabrisas","EVA","Parabrisas","002131423.9","NASACAR"," 00991.9","STARGLASS: 0809497/22540",608,"Acordo","2025-01-20","2026-01-20"]
["CP10.2024.00001","CP10.2024: Parabrisas","EVA","Parabrisas","002131423.9","EXPRESSGLASS","02143.9","Pilkington: 632 671 19 10",774.1,"Alternativa 1","2025-01-20","2026-01-20"]
["CP10.2024.00001","CP10.2024: Parabrisas","EVA","Parabrisas","002131423.9","CBM","09403.9","MB: A6326711910",980,"Alternativa 2","2025-01-20","2026-01-20"]
["CP10.2024.00002","CP10.2024: Parabrisas","EVA","Parabrisas","002152767.9","NASACAR"," 00991.9","STARGLASS: 0820450/22250",802,"Acordo","2025-01-20","2026-01-20"]
["CP10.2024.00002","CP10.2024: Parabrisas","EVA","Parabrisas","002152767.9","EXPRESSGLASS","02143.9","Pilkington: 632 670 15 01",842.3,"Alternativa 1","2025-01-20","2026-01-20"]
["CP10.2024.00002","CP10.2024: Parabrisas","EVA","Parabrisas","002152767.9","CBM","09403.9","Pilkington: D9502084",868,"Alternativa 2","2025-01-20","2026-01-20"]
["CP10.2024.00004","CP10.2024: Parabrisas","EVA","Parabrisas","002140648.9","NASACAR"," 00991.9","STARGLASS: 0809136/22540",480,"Acordo","2025-01-20","2026-01-20"]
["CP10.2024.00004","CP10.2024: Parabrisas","EVA","Parabrisas","002140648.9","CBM","09403.9","finnlamex: D9403411",599.20000000000005,"Alternativa 1","2025-01-20","2026-01-20"]
["CP10.2024.00004","CP10.2024: Parabrisas","EVA","Parabrisas","002140648.9","EXPRESSGLASS","02143.9","Pilkington: 592009",826.9,"Alternativa 2","2025-01-20","2026-01-20"]
["CP10.2024.00005","CP10.2024: Parabrisas","EVA","Parabrisas","002131605.9","NASACAR"," 00991.9","STARGLASS: 0833073/22540",810,"Acordo","2025-01-20","2026-01-20"]
["CP10.2024.00005","CP10.2024: Parabrisas","EVA","Parabrisas","002131605.9","EXPRESSGLASS","02143.9","Pilkington: 410 670 16 01",1037,"Alternativa 1","2025-01-20","2026-01-20"]
["CP10.2024.00005","CP10.2024: Parabrisas","EVA","Parabrisas","002131605.9","CBM","09403.9","MB: A4106701601",1330,"Alternativa 2","2025-01-20","2026-01-20"]
["CP10.2024.00006","CP10.2024: Parabrisas","EVA","Parabrisas","002130193.9","NASACAR"," 00991.9","STARGLASS: 0809289/22540",665,"Acordo","2025-01-20","2026-01-20"]
["CP10.2024.00008","CP10.2024: Parabrisas","EVA","Parabrisas","002130417.9","NASACAR"," 00991.9","STARGLASS: 0809207/22540",660,"Acordo","2025-01-20","2026-01-20"]
["CP10.2024.00008","CP10.2024: Parabrisas","EVA","Parabrisas","002130417.9","CBM","09403.9","Pilkington: D94094038",660,"Alternativa 1","2025-01-20","2026-01-20"]
["CP10.2024.00009","CP10.2024: Parabrisas","EVA","Parabrisas","002131340.9","NASACAR"," 00991.9","STARGLASS: 0820390/22540",750,"Acordo","2025-01-20","2026-01-20"]
["CP10.2024.00009","CP10.2024: Parabrisas","EVA","Parabrisas","002131340.9","CBM","09403.9","Pilkington: D9390240",805,"Alternativa 1","2025-01-20","2026-01-20"]
["CP10.2024.00009","CP10.2024: Parabrisas","EVA","Parabrisas","002131340.9","EXPRESSGLASS","02143.9","Pilkington: 633 671 00 10",833.3,"Alternativa 2","2025-01-20","2026-01-20"]
["CP10.2024.00011","CP10.2024: Parabrisas","EVA","Parabrisas","002170546.9","NASACAR"," 00991.9","STRAGLASS: 0809266/22540",715,"Acordo","2025-01-20","2026-01-20"]
["CP10.2024.00011","CP10.2024: Parabrisas","EVA","Parabrisas","002170546.9","CBM","09403.9","finnlamex: D9403599",749.5,"Alternativa 1","2025-01-20","2026-01-20"]
["CP10.2024.00011","CP10.2024: Parabrisas","EVA","Parabrisas","002170546.9","EXPRESSGLASS","02143.9","Pilkington: 592414",883.3,"Alternativa 2","2025-01-20","2026-01-20"]
["CP10.2024.00012","CP10.2024: Parabrisas","EVA","Parabrisas","002131555.9","NASACAR"," 00991.9","STRAGLASS: 0835316/22540",675,"Acordo","2025-01-20","2026-01-20"]
["CP10.2024.00012","CP10.2024: Parabrisas","EVA","Parabrisas","002131555.9","CBM","09403.9","MERCEDES: A6326710010",1360,"Alternativa 1","2025-01-20","2026-01-20"]
["CP10.2024.00014","CP10.2024: Parabrisas","EVA","Parabrisas","002131464.9","CBM","09403.9","Pilkington: D9297005",660,"Acordo","2025-01-20","2026-01-20"]
["CP10.2024.00014","CP10.2024: Parabrisas","EVA","Parabrisas","002131464.9","NASACAR"," 00991.9","STRAGLASS: 0811052/22540",798,"Alternativa 1","2025-01-20","2026-01-20"]
["CP10.2024.00014","CP10.2024: Parabrisas","EVA","Parabrisas","002131464.9","EXPRESSGLASS","02143.9","Pilkington: 88751010902",911.7,"Alternativa 2","2025-01-20","2026-01-20"]
["CP10.2024.00018","CP10.2024: Parabrisas","EVA","Parabrisas","004232328.9","CBM","09403.9","finnlamex: D9507662",966,"Acordo","2025-01-20","2026-01-20"]
["CP10.2024.00018","CP10.2024: Parabrisas","EVA","Parabrisas","004232328.9","NASACAR"," 00991.9","TERGLASS: 0823701/33191",1840,"Alternativa 1","2025-01-20","2026-01-20"]
["CP10.2024.00024","CP10.2024: Parabrisas","EVA","Oculo Traseiro","002190379.9","EXPRESSGLASS","02143.9","Pilkington: 633 678 00 10",336.1,"Acordo","2025-01-20","2026-01-20"]
["CP10.2024.00024","CP10.2024: Parabrisas","EVA","Oculo Traseiro","002190379.9","NASACAR"," 00991.9","TERGLASS: 0828050/33191",460,"Alternativa 1","2025-01-20","2026-01-20"]
["CP10.2024.00024","CP10.2024: Parabrisas","EVA","Oculo Traseiro","002190379.9","CBM","09403.9","MB: D9392246",720.3,"Alternativa 2","2025-01-20","2026-01-20"]
["CP10.2024.00025","CP10.2024: Parabrisas","EVA","Oculo Traseiro","002132215.9","CBM","09403.9","IRIZAR: D9405873",646,"Acordo","2025-01-20","2026-01-20"]
["CP10.2024.00025","CP10.2024: Parabrisas","EVA","Oculo Traseiro","002132215.9","NASACAR"," 00991.9","VIDUR: 0820639/22630",898,"Alternativa 1","2025-01-20","2026-01-20"]
["CP10.2024.00032","CP10.2024: Parabrisas","EVA","vidro porta","002161081.9","CBM","09403.9","SAINT G: D9297535",490,"Acordo","2025-01-20","2026-01-20"]
["CP10.2024.00033","CP10.2024: Parabrisas","EVA","vidro porta","002170173.9","NASACAR"," 00991.9","VITROPOR: 0823130/1135",288,"Acordo","2025-01-20","2026-01-20"]
["CP10.2024.00033","CP10.2024: Parabrisas","EVA","vidro porta","002170173.9","CBM","09403.9","SAINT G: D9297536",620,"Alternativa 1","2025-01-20","2026-01-20"]
["CP10.2024.00001","CP10.2024: Parabrisas","RA","Parabrisas","002131092.8","NASACAR"," 04483.8","STARGLASS: 0809497/22540",608,"Acordo","2025-01-20","2026-01-20"]
["CP10.2024.00001","CP10.2024: Parabrisas","RA","Parabrisas","002131092.8","EXPRESSGLASS","02143.8","Pilkington: 632 671 19 10",774.1,"Alternativa 1","2025-01-20","2026-01-20"]
["CP10.2024.00001","CP10.2024: Parabrisas","RA","Parabrisas","002131092.8","CBM","09403.8","MB: A6326711910",980,"Alternativa 2","2025-01-20","2026-01-20"]
["CP10.2024.00002","CP10.2024: Parabrisas","RA","Parabrisas","002131175.8","NASACAR"," 04483.8","STARGLASS: 0820450/22250",802,"Acordo","2025-01-20","2026-01-20"]
["CP10.2024.00002","CP10.2024: Parabrisas","RA","Parabrisas","002131175.8","EXPRESSGLASS","02143.8","Pilkington: 632 670 15 01",842.3,"Alternativa 1","2025-01-20","2026-01-20"]
["CP10.2024.00002","CP10.2024: Parabrisas","RA","Parabrisas","002131175.8","CBM","09403.8","Pilkington: D9502084",868,"Alternativa 2","2025-01-20","2026-01-20"]
["CP10.2024.00004","CP10.2024: Parabrisas","RA","Parabrisas","002130938.8","NASACAR"," 04483.8","STARGLASS: 0809136/22540",480,"Acordo","2025-01-20","2026-01-20"]
["CP10.2024.00004","CP10.2024: Parabrisas","RA","Parabrisas","002130938.8","CBM","09403.8","finnlamex: D9403411",599.20000000000005,"Alternativa 1","2025-01-20","2026-01-20"]
["CP10.2024.00004","CP10.2024: Parabrisas","RA","Parabrisas","002130938.8","EXPRESSGLASS","02143.8","Pilkington: 592009",826.9,"Alternativa 2","2025-01-20","2026-01-20"]
["CP10.2024.00006","CP10.2024: Parabrisas","RA","Parabrisas","002131001.8","NASACAR"," 04483.8","STARGLASS: 0809289/22540",665,"Acordo","2025-01-20","2026-01-20"]
["CP10.2024.00008","CP10.2024: Parabrisas","RA","Parabrisas","002130771.8","NASACAR"," 04483.8","STARGLASS: 0809207/22540",660,"Acordo","2025-01-20","2026-01-20"]
["CP10.2024.00008","CP10.2024: Parabrisas","RA","Parabrisas","002130771.8","CBM","09403.8","Pilkington: D94094038",660,"Alternativa 1","2025-01-20","2026-01-20"]
["CP10.2024.00009","CP10.2024: Parabrisas","RA","Parabrisas","002131423.8","NASACAR"," 04483.8","STARGLASS: 0820390/22540",750,"Acordo","2025-01-20","2026-01-20"]
["CP10.2024.00009","CP10.2024: Parabrisas","RA","Parabrisas","002131423.8","CBM","09403.8","Pilkington: D9390240",805,"Alternativa 1","2025-01-20","2026-01-20"]
["CP10.2024.00009","CP10.2024: Parabrisas","RA","Parabrisas","002131423.8","EXPRESSGLASS","02143.8","Pilkington: 633 671 00 10",833.3,"Alternativa 2","2025-01-20","2026-01-20"]
["CP10.2024.00013","CP10.2024: Parabrisas","RA","Parabrisas","002131506.8","CBM","09403.8","finnlamex: D9404361",617.4,"Acordo","2025-01-20","2026-01-20"]
["CP10.2024.00013","CP10.2024: Parabrisas","RA","Parabrisas","002131506.8","NASACAR"," 04483.8","STRAGLASS: 0801647/22540",645,"Alternativa 1","2025-01-20","2026-01-20"]
["CP10.2024.00017","CP10.2024: Parabrisas","RA","Parabrisas","002131084.8","NASACAR"," 04483.8","STRAGLASS: 0801113/22540",660,"Acordo","2025-01-20","2026-01-20"]
["CP10.2024.00022","CP10.2024: Parabrisas","RA","Parabrisas","002131118.8","NASACAR"," 04483.8","STARGLASS: 0801113/22540",660,"Acordo","2025-01-20","2026-01-20"]
["CP10.2024.00022","CP10.2024: Parabrisas","RA","Parabrisas","002131118.8","CBM","09403.8","Pilkington: D9193098",672,"Alternativa 1","2025-01-20","2026-01-20"]
["CP10.2024.00024","CP10.2024: Parabrisas","RA","Oculo Traseiro","002131167.8","EXPRESSGLASS","02143.8","Pilkington: 633 678 00 10",336.1,"Acordo","2025-01-20","2026-01-20"]
["CP10.2024.00024","CP10.2024: Parabrisas","RA","Oculo Traseiro","002131167.8","NASACAR"," 04483.8","TERGLASS: 0828050/33191",460,"Alternativa 1","2025-01-20","2026-01-20"]
["CP10.2024.00024","CP10.2024: Parabrisas","RA","Oculo Traseiro","002131167.8","CBM","09403.8","MB: D9392246",720.3,"Alternativa 2","2025-01-20","2026-01-20"]
["CP10.2024.00032","CP10.2024: Parabrisas","RA","vidro porta","002140069.8","CBM","09403.8","SAINT G: D9297535",490,"Acordo","2025-01-20","2026-01-20"]

{"sheet":"RefParts","index":1,"n_rows":59,"n_cols":19,"rows_kept":59,"cut":false,"hidden":false,"merged":[]}
["Ref Acordo","Nome Acordo","Empresa","Descrição Peça","CAE","Acodro: Fornecedor","Acordo: CFE","Acordo: Marca Modelo","Acordo: VUnit","Acordo: Data I","Acordo: Data F","Alt1: Fornecedor","Alt1: CFE","Alt1: Marca Modelo","Alt1: VUnit","Alt2: Fornecedor","Alt2: CFE","Alt2: Marca Modelo","Alt2: VUnit"]
["CP10.2024.00001","CP10.2024: Parabrisas","BT","Parabrisas","002133031.10","NASACAR","20082.10","STARGLASS: 0809497/22540",608,"2025-01-20","2026-01-20","EXPRESSGLASS","17910.10","Pilkington: 632 671 19 10",774.1,"CBM","30052.10","MB: A6326711910",980]
["CP10.2024.00002","CP10.2024: Parabrisas","BT","Parabrisas","002133635.10","NASACAR","20082.10","STARGLASS: 0820450/22250",802,"2025-01-20","2026-01-20","EXPRESSGLASS","17910.10","Pilkington: 632 670 15 01",842.3,"CBM","30052.10","Pilkington: D9502084",868]
["CP10.2024.00003","CP10.2024: Parabrisas","BT","Parabrisas","002134013.10","NASACAR","20082.10","TERGLASS: 0834242/22540",810,"2025-01-20","2026-01-20","CBM","30052.10","finnlamex: D9413654",994,"EXPRESSGLASS","17910.10","Pilkington: 410 670 40 01",1144.3]
["CP10.2024.00004","CP10.2024: Parabrisas","BT","Parabrisas","002132678.10","NASACAR","20082.10","STARGLASS: 0809136/22540",480,"2025-01-20","2026-01-20","CBM","30052.10","finnlamex: D9403411",599.20000000000005,"EXPRESSGLASS","17910.10","Pilkington: 592009",826.9]
["CP10.2024.00005","CP10.2024: Parabrisas","BT","Parabrisas","002133809.10","NASACAR","20082.10","STARGLASS: 0833073/22540",810,"2025-01-20","2026-01-20","EXPRESSGLASS","17910.10","Pilkington: 410 670 16 01",1037,"CBM","30052.10","MB: A4106701601",1330]
["CP10.2024.00006","CP10.2024: Parabrisas","BT","Parabrisas","002132637.10","NASACAR","20082.10","STARGLASS: 0809289/22540",665,"2025-01-20","2026-01-20"]
["CP10.2024.00007","CP10.2024: Parabrisas","BT","Parabrisas","002157147.10","NASACAR","20082.10","STARGLASS: 0834562/22540",755,"2025-01-20","2026-01-20","CBM","30052.10","finnlamex: D9413144",770,"EXPRESSGLASS","17910.10","Pilkington: 410 670 63 01",924.1]
["CP10.2024.00007","CP10.2024: Parabrisas","BT","Parabrisas","002134195.10","NASACAR","20082.10","STARGLASS: 0834562/22540",755,"2025-01-20","2026-01-20","CBM","30052.10","finnlamex: D9413144",770,"EXPRESSGLASS","17910.10","Pilkington: 410 670 63 01",924.1]
["CP10.2024.00008","CP10.2024: Parabrisas","BT","Parabrisas","002133619.10","NASACAR","20082.10","STARGLASS: 0809207/22540",660,"2025-01-20","2026-01-20","CBM","30052.10","Pilkington: D94094038",660]
["CP10.2024.00009","CP10.2024: Parabrisas","BT","Parabrisas","002133585.10","NASACAR","20082.10","STARGLASS: 0820390/22540",750,"2025-01-20","2026-01-20","CBM","30052.10","Pilkington: D9390240",805,"EXPRESSGLASS","17910.10","Pilkington: 633 671 00 10",833.3]
["CP10.2024.00010","CP10.2024: Parabrisas","BT","Parabrisas","002132611.10","NASACAR","20082.10","STRAGLASS: 0809056/22540",700,"2025-01-20","2026-01-20","CBM","30052.10","Pilkington: D9390240",860,"EXPRESSGLASS","17910.10","Pilkington: 632 671 00 10",1116.7]
["CP10.2024.00011","CP10.2024: Parabrisas","BT","Parabrisas","002133270.10","NASACAR","20082.10","STRAGLASS: 0809266/22540",715,"2025-01-20","2026-01-20","CBM","30052.10","finnlamex: D9403599",749.5,"EXPRESSGLASS","17910.10","Pilkington: 592414",883.3]
["CP10.2024.00013","CP10.2024: Parabrisas","BT","Parabrisas","002133288.10","CBM","30052.10","finnlamex: D9404361",617.4,"2025-01-20","2026-01-20","NASACAR","20082.10","STRAGLASS: 0801647/22540",645]
["CP10.2024.00014","CP10.2024: Parabrisas","BT","Parabrisas","002131134.10","CBM","30052.10","Pilkington: D9297005",660,"2025-01-20","2026-01-20","NASACAR","20082.10","STRAGLASS: 0811052/22540",798,"EXPRESSGLASS","17910.10","Pilkington: 88751010902",911.7]
["CP10.2024.00015","CP10.2024: Parabrisas","BT","Parabrisas","002157220.10","CBM","30052.10","MERCEDES: A4106705510",1550,"2025-01-20","2026-01-20"]
["CP10.2024.00016","CP10.2024: Parabrisas","BT","Parabrisas","002133593.10",null,null,": ",null,"2025-01-20","2026-01-20"]
["CP10.2024.00019","CP10.2024: Parabrisas","BT","Parabrisas","002132900.10","NASACAR","20082.10","SAINT-GOBAIN: 0809466/167",1190,"2025-01-20","2026-01-20","CBM","30052.10","MERCEDES: A6326710310",1480,"EXPRESSGLASS","17910.10","Pilkington: 632 671 03 10",1566.7]
["CP10.2024.00021","CP10.2024: Parabrisas","BT","Parabrisas","004592275.10","CBM","30052.10","finnlamex: D9404591",465,"2025-01-20","2026-01-20","NASACAR","20082.10","TERGLASS: 0823026/33191",710]
["CP10.2024.00023","CP10.2024: Parabrisas","BT","Oculo Traseiro","002157113.10","CBM","30052.10","MERCEDES: D9414252",700.5,"2025-01-20","2026-01-20"]
["CP10.2024.00024","CP10.2024: Parabrisas","BT","Oculo Traseiro","002133098.10","EXPRESSGLASS","17910.10","Pilkington: 633 678 00 10",336.1,"2025-01-20","2026-01-20","NASACAR","20082.10","TERGLASS: 0828050/33191",460,"CBM","30052.10","MB: D9392246",720.3]
["CP10.2024.00028","CP10.2024: Parabrisas","BT","Vidro janela motorista","002153740.10","CBM","30052.10","CBM PART: D9413599",554,"2025-01-20","2026-01-20"]
["CP10.2024.00029","CP10.2024: Parabrisas","BT","Vidro lateral","002134088.10",null,null,": ",null,"2025-01-20","2026-01-20"]
["CP10.2024.00030","CP10.2024: Parabrisas","BT","Vidro lateral","002155596.10","CBM","30052.10","CBM PART: D9411173",748,"2025-01-20","2026-01-20"]
["CP10.2024.00031","CP10.2024: Parabrisas","BT","Vidro lateral","002155968.10",null,null,": ",null,"2025-01-20","2026-01-20"]
["CP10.2024.00032","CP10.2024: Parabrisas","BT","vidro porta","004596037.10","CBM","30052.10","SAINT G: D9297535",490,"2025-01-20","2026-01-20"]
["CP10.2024.00033","CP10.2024: Parabrisas","BT","vidro porta","002155778.10","NASACAR","20082.10","VITROPOR: 0823130/1135",288,"2025-01-20","2026-01-20","CBM","30052.10","SAINT G: D9297536",620]
["CP10.2024.00034","CP10.2024: Parabrisas","BT","vidro porta","002143022.10","CBM","30052.10","MERCEDES: A6446734406",490,"2025-01-20","2026-01-20"]
["CP10.2024.00035","CP10.2024: Parabrisas","BT","vidro porta","002157139.10","CBM","30052.10","MERCEDES: A4107351110",290,"2025-01-20","2026-01-20"]
["CP10.2024.00007","CP10.2024: Parabrisas","RL","Parabrisas","002133031.16","NASACAR"," 06657 .16","STARGLASS: 0834562/22540",755,"2025-01-20","2026-01-20","CBM","09403 .16","finnlamex: D9413144",770,"EXPRESSGLASS","02143.16","Pilkington: 410 670 63 01",924.1]
["CP10.2024.00023","CP10.2024: Parabrisas","RL","Oculo Traseiro","002133056.16","CBM","09403 .16","MERCEDES: D9414252",700.5,"2025-01-20","2026-01-20"]
["CP10.2024.00026","CP10.2024: Parabrisas","RL","Vidro divisoria interior","002163178.16","CBM","09403 .16","MERCEDES: A3947111710",490,"2025-01-20","2026-01-20"]
["CP10.2024.00027","CP10.2024: Parabrisas","RL","Vidro janela motorista","002163061.16","CBM","09403 .16","MERCEDES: A3116708411",1690,"2025-01-20","2026-01-20"]
["CP10.2024.00001","CP10.2024: Parabrisas","EVA","Parabrisas","002131423.9","NASACAR"," 00991.9","STARGLASS: 0809497/22540",608,"2025-01-20","2026-01-20","EXPRESSGLASS","02143.9","Pilkington: 632 671 19 10",774.1,"CBM","09403.9","MB: A6326711910",980]
["CP10.2024.00002","CP10.2024: Parabrisas","EVA","Parabrisas","002152767.9","NASACAR"," 00991.9","STARGLASS: 0820450/22250",802,"2025-01-20","2026-01-20","EXPRESSGLASS","02143.9","Pilkington: 632 670 15 01",842.3,"CBM","09403.9","Pilkington: D9502084",868]
["CP10.2024.00004","CP10.2024: Parabrisas","EVA","Parabrisas","002140648.9","NASACAR"," 00991.9","STARGLASS: 0809136/22540",480,"2025-01-20","2026-01-20","CBM","09403.9","finnlamex: D9403411",599.20000000000005,"EXPRESSGLASS","02143.9","Pilkington: 592009",826.9]
["CP10.2024.00005","CP10.2024: Parabrisas","EVA","Parabrisas","002131605.9","NASACAR"," 00991.9","STARGLASS: 0833073/22540",810,"2025-01-20","2026-01-20","EXPRESSGLASS","02143.9","Pilkington: 410 670 16 01",1037,"CBM","09403.9","MB: A4106701601",1330]
["CP10.2024.00006","CP10.2024: Parabrisas","EVA","Parabrisas","002130193.9","NASACAR"," 00991.9","STARGLASS: 0809289/22540",665,"2025-01-20","2026-01-20"]
["CP10.2024.00008","CP10.2024: Parabrisas","EVA","Parabrisas","002130417.9","NASACAR"," 00991.9","STARGLASS: 0809207/22540",660,"2025-01-20","2026-01-20","CBM","09403.9","Pilkington: D94094038",660]
["CP10.2024.00009","CP10.2024: Parabrisas","EVA","Parabrisas","002131340.9","NASACAR"," 00991.9","STARGLASS: 0820390/22540",750,"2025-01-20","2026-01-20","CBM","09403.9","Pilkington: D9390240",805,"EXPRESSGLASS","02143.9","Pilkington: 633 671 00 10",833.3]
["CP10.2024.00011","CP10.2024: Parabrisas","EVA","Parabrisas","002170546.9","NASACAR"," 00991.9","STRAGLASS: 0809266/22540",715,"2025-01-20","2026-01-20","CBM","09403.9","finnlamex: D9403599",749.5,"EXPRESSGLASS","02143.9","Pilkington: 592414",883.3]
["CP10.2024.00012","CP10.2024: Parabrisas","EVA","Parabrisas","002131555.9","NASACAR"," 00991.9","STRAGLASS: 0835316/22540",675,"2025-01-20","2026-01-20","CBM","09403.9","MERCEDES: A6326710010",1360]
["CP10.2024.00014","CP10.2024: Parabrisas","EVA","Parabrisas","002131464.9","CBM","09403.9","Pilkington: D9297005",660,"2025-01-20","2026-01-20","NASACAR"," 00991.9","STRAGLASS: 0811052/22540",798,"EXPRESSGLASS","02143.9","Pilkington: 88751010902",911.7]
["CP10.2024.00018","CP10.2024: Parabrisas","EVA","Parabrisas","004232328.9","CBM","09403.9","finnlamex: D9507662",966,"2025-01-20","2026-01-20","NASACAR"," 00991.9","TERGLASS: 0823701/33191",1840]
["CP10.2024.00024","CP10.2024: Parabrisas","EVA","Oculo Traseiro","002190379.9","EXPRESSGLASS","02143.9","Pilkington: 633 678 00 10",336.1,"2025-01-20","2026-01-20","NASACAR"," 00991.9","TERGLASS: 0828050/33191",460,"CBM","09403.9","MB: D9392246",720.3]
["CP10.2024.00025","CP10.2024: Parabrisas","EVA","Oculo Traseiro","002132215.9","CBM","09403.9","IRIZAR: D9405873",646,"2025-01-20","2026-01-20","NASACAR"," 00991.9","VIDUR: 0820639/22630",898]
["CP10.2024.00032","CP10.2024: Parabrisas","EVA","vidro porta","002161081.9","CBM","09403.9","SAINT G: D9297535",490,"2025-01-20","2026-01-20"]
["CP10.2024.00033","CP10.2024: Parabrisas","EVA","vidro porta","002170173.9","NASACAR"," 00991.9","VITROPOR: 0823130/1135",288,"2025-01-20","2026-01-20","CBM","09403.9","SAINT G: D9297536",620]
["CP10.2024.00001","CP10.2024: Parabrisas","RA","Parabrisas","002131092.8","NASACAR"," 04483.8","STARGLASS: 0809497/22540",608,"2025-01-20","2026-01-20","EXPRESSGLASS","02143.8","Pilkington: 632 671 19 10",774.1,"CBM","09403.8","MB: A6326711910",980]
["CP10.2024.00002","CP10.2024: Parabrisas","RA","Parabrisas","002131175.8","NASACAR"," 04483.8","STARGLASS: 0820450/22250",802,"2025-01-20","2026-01-20","EXPRESSGLASS","02143.8","Pilkington: 632 670 15 01",842.3,"CBM","09403.8","Pilkington: D9502084",868]
["CP10.2024.00004","CP10.2024: Parabrisas","RA","Parabrisas","002130938.8","NASACAR"," 04483.8","STARGLASS: 0809136/22540",480,"2025-01-20","2026-01-20","CBM","09403.8","finnlamex: D9403411",599.20000000000005,"EXPRESSGLASS","02143.8","Pilkington: 592009",826.9]
["CP10.2024.00006","CP10.2024: Parabrisas","RA","Parabrisas","002131001.8","NASACAR"," 04483.8","STARGLASS: 0809289/22540",665,"2025-01-20","2026-01-20"]
["CP10.2024.00008","CP10.2024: Parabrisas","RA","Parabrisas","002130771.8","NASACAR"," 04483.8","STARGLASS: 0809207/22540",660,"2025-01-20","2026-01-20","CBM","09403.8","Pilkington: D94094038",660]
["CP10.2024.00009","CP10.2024: Parabrisas","RA","Parabrisas","002131423.8","NASACAR"," 04483.8","STARGLASS: 0820390/22540",750,"2025-01-20","2026-01-20","CBM","09403.8","Pilkington: D9390240",805,"EXPRESSGLASS","02143.8","Pilkington: 633 671 00 10",833.3]
["CP10.2024.00013","CP10.2024: Parabrisas","RA","Parabrisas","002131506.8","CBM","09403.8","finnlamex: D9404361",617.4,"2025-01-20","2026-01-20","NASACAR"," 04483.8","STRAGLASS: 0801647/22540",645]
["CP10.2024.00017","CP10.2024: Parabrisas","RA","Parabrisas","002131084.8","NASACAR"," 04483.8","STRAGLASS: 0801113/22540",660,"2025-01-20","2026-01-20"]
["CP10.2024.00022","CP10.2024: Parabrisas","RA","Parabrisas","002131118.8","NASACAR"," 04483.8","STARGLASS: 0801113/22540",660,"2025-01-20","2026-01-20","CBM","09403.8","Pilkington: D9193098",672]
["CP10.2024.00024","CP10.2024: Parabrisas","RA","Oculo Traseiro","002131167.8","EXPRESSGLASS","02143.8","Pilkington: 633 678 00 10",336.1,"2025-01-20","2026-01-20","NASACAR"," 04483.8","TERGLASS: 0828050/33191",460,"CBM","09403.8","MB: D9392246",720.3]
["CP10.2024.00032","CP10.2024: Parabrisas","RA","vidro porta","002140069.8","CBM","09403.8","SAINT G: D9297535",490,"2025-01-20","2026-01-20"]

{"sheet":"Fornecedores II","index":2,"n_rows":97,"n_cols":4,"rows_kept":97,"cut":false,"hidden":false,"merged":[]}
["Empresa","Nome","CFE","NIF"]
["BT","NASACAR","20082.10",500615250]
["BT","NORS","49365.10",500662860]
["BT","COPEROL","15456.10",502021160]
["BT","KRAULTI","20213.10",502271450]
["BT","GLOBAL P","49333.10",509436722]
["BT","MOTORBUS","16366.10",503500992]
["BT","TECNIAMPER","14471.10",501948775]
["BT","CBM","30052.10","B85631083"]
["BT","EUROPART","16559.10",503791970]
["BT","EXPRESSGLASS","17910.10",506749495]
["BT","CARBUS","15202.10",503801461]
["BT","IM","15049.10",500952981]
["BT","AGT","14691.10",501276343]
["BT","ATLASBUS","48746.10","B27739879"]
["BT","HYDRAPLAN","30131.10",507448979]
["BT","DAIMLER TR","49398.10",516853252]
["RL","NASACAR"," 06657 .16",500615250]
["RL","NORS","10004.16",500662860]
["RL","COPEROL"," 10000.16",502021160]
["RL","KRAULTI","08024.16",502271450]
["RL","GLOBAL P"," 09997.16",509436722]
["RL","MOTORBUS","8679.16",503500992]
["RL","TECNIAMPER","07215 .16",501948775]
["RL","CBM","09403 .16","B85631083"]
["RL","EUROPART"," 08718.16",503791970]
["RL","EXPRESSGLASS","02143.16",506749495]
["RL","CARBUS"," 08654.16",503801461]
["RL","IM","08251 .16",500952981]
["RL","AGT"," 09870.16",501276343]
["RL","ATLASBUS"," 08782.16","B27739879"]
["RL","HYDRAPLAN","08935.16",507448979]
["RL","DAIMLER TR","10011.16",516853252]
["EVA","NASACAR"," 00991.9",500615250]
["EVA","NORS"," 39064.9",500662860]
["EVA","COPEROL"," 00293 .9",502021160]
["EVA","KRAULTI","0017.9",502271450]
["EVA","GLOBAL P"," 01635.9",509436722]
["EVA","MOTORBUS"," 01499.9",503500992]
["EVA","TECNIAMPER"," 01371.9",501948775]
["EVA","CBM","09403.9","B85631083"]
["EVA","EUROPART","386.9",503791970]
["EVA","EXPRESSGLASS","02143.9",506749495]
["EVA","CARBUS"," 03807 .9",503801461]
["EVA","IM","00526.9",500952981]
["EVA","AGT"," 03145.9",501276343]
["EVA","ATLASBUS","48746.9","B27739879"]
["EVA","HYDRAPLAN","00466.9",507448979]
["EVA","DAIMLER TR","00348.9",516853252]
["RA","NASACAR"," 04483.8",500615250]
["RA","NORS"," 04516.8",500662860]
["RA","COPEROL"," 01504.8",502021160]
["RA","KRAULTI","03627.8",502271450]
["RA","GLOBAL P","49333.8",509436722]
["RA","MOTORBUS"," 04363.8",503500992]
["RA","TECNIAMPER","06210 .8",501948775]
["RA","CBM","09403.8","B85631083"]
["RA","EUROPART"," 02112.8",503791970]
["RA","EXPRESSGLASS","02143.8",506749495]
["RA","CARBUS"," 01030.8",503801461]
["RA","IM"," 03122.8",500952981]
["RA","AGT"," 00298.8",501276343]
["RA","ATLASBUS"," 00102.8","B27739879"]
["RA","HYDRAPLAN","02920.8",507448979]
["RA","DAIMLER TR","01468.8",516853252]
["RT","NASACAR"," 21677.4",500615250]
["RT","NORS"," 22998.4",500662860]
["RT","COPEROL","20438 .4",502021160]
["RT","KRAULTI","21655.4",502271450]
["RT","GLOBAL P","49333.4",509436722]
["RT","MOTORBUS"," 22040.4",503500992]
["RT","TECNIAMPER"," 22155.4",501948775]
["RT","CBM"," 30371.4","B85631083"]
["RT","EUROPART"," 20639.4",503791970]
["RT","EXPRESSGLASS","02143.4",506749495]
["RT","CARBUS"," 20460.4",503801461]
["RT","IM"," 21114.4",500952981]
["RT","AGT"," 20120.4",501276343]
["RT","ATLASBUS","48746.4","B27739879"]
["RT","HYDRAPLAN","21102.4",507448979]
["RT","DAIMLER TR","24153.4",516853252]
["ROeste","NASACAR"," 21677.84",500615250]
["ROeste","NORS"," 22998.84",500662860]
["ROeste","COPEROL","20438 .84",502021160]
["ROeste","KRAULTI","21655.84",502271450]
["ROeste","GLOBAL P","49333.84",509436722]
["ROeste","MOTORBUS"," 22040.84",503500992]
["ROeste","TECNIAMPER"," 22155.84",501948775]
["ROeste","CBM"," 30371.84","B85631083"]
["ROeste","EUROPART"," 20639.84",503791970]
["ROeste","EXPRESSGLASS","02143.84",506749495]
["ROeste","CARBUS"," 20460.84",503801461]
["ROeste","IM"," 21114.84",500952981]
["ROeste","AGT"," 20120.84",501276343]
["ROeste","ATLASBUS","48746.84","B27739879"]
["ROeste","HYDRAPLAN","21102.84",507448979]
["ROeste","DAIMLER TR","24153.84",516853252]

{"sheet":"CP10.2024","index":3,"n_rows":37,"n_cols":32,"rows_kept":37,"cut":false,"hidden":false,"merged":[[0,1,0,5],[0,6,0,13],[0,14,0,31]]}
[null,"Códigos dos artigos por empresa",null,null,null,null,"Condições a carregar no arcodo",null,null,null,null,null,null,null,"Outras ordens a criar nos artigos além da do acordo"]
["Descrição","BT","RL","EVA","RA","TEJO","FORNECEDOR","NIF","ordem","Marca","Referência","P Un","Data inicio","Data de fim","FORNECEDOR","NIF","ordem","Marca","Referência","P Un","FORNECEDOR","NIF","ordem","Marca","Referência","P Un","FORNECEDOR","NIF","ordem","Marca","Referência","P Un"]
["Parabrisas","002133031",null,"002131423","002131092",null,"NASACAR",{"$f":"VLOOKUP(G3,Fornecedores!A2:B17,2,FALSE)","v":500615250},31,"STARGLASS","0809497/22540",608,"2025-01-20","2026-01-20","EXPRESSGLASS",{"$f":"VLOOKUP(O3,Fornecedores!$A$2:$B$17,2,FALSE)","v":506749495},32,"Pilkington","632 671 19 10",774.1,"CBM",{"$f":"VLOOKUP(U3,Fornecedores!$A$2:$B$17,2,FALSE)","v":"B85631083"},33,"MB","A6326711910",980]
["Parabrisas","002133635",null,"002152767","002131175",null,"NASACAR",{"$f":"VLOOKUP(G4,Fornecedores!$A$2:$B$17,2,FALSE)","v":500615250},31,"STARGLASS","0820450/22250",802,"2025-01-20","2026-01-20","EXPRESSGLASS",{"$f":"VLOOKUP(O4,Fornecedores!$A$2:$B$17,2,FALSE)","v":506749495},32,"Pilkington","632 670 15 01",842.3,"CBM",{"$f":"VLOOKUP(U4,Fornecedores!$A$2:$B$17,2,FALSE)","v":"B85631083"},33,"Pilkington","D9502084",868]
["Parabrisas","002134013",null,null,null,null,"NASACAR",{"$f":"VLOOKUP(G5,Fornecedores!$A$2:$B$17,2,FALSE)","v":500615250},31,"TERGLASS","0834242/22540",810,"2025-01-20","2026-01-20","CBM",{"$f":"VLOOKUP(O5,Fornecedores!$A$2:$B$17,2,FALSE)","v":"B85631083"},32,"finnlamex","D9413654",994,"EXPRESSGLASS",{"$f":"VLOOKUP(U5,Fornecedores!$A$2:$B$17,2,FALSE)","v":506749495},33,"Pilkington","410 670 40 01",1144.3]
["Parabrisas","002132678",null,"002140648","002130938",null,"NASACAR",{"$f":"VLOOKUP(G6,Fornecedores!$A$2:$B$17,2,FALSE)","v":500615250},31,"STARGLASS","0809136/22540",480,"2025-01-20","2026-01-20","CBM",{"$f":"VLOOKUP(O6,Fornecedores!$A$2:$B$17,2,FALSE)","v":"B85631083"},32,"finnlamex","D9403411",599.20000000000005,"EXPRESSGLASS",{"$f":"VLOOKUP(U6,Fornecedores!$A$2:$B$17,2,FALSE)","v":506749495},33,"Pilkington","592009",826.9]
["Parabrisas","002133809",null,"002131605",null,null,"NASACAR",{"$f":"VLOOKUP(G7,Fornecedores!$A$2:$B$17,2,FALSE)","v":500615250},31,"STARGLASS","0833073/22540",810,"2025-01-20","2026-01-20","EXPRESSGLASS",{"$f":"VLOOKUP(O7,Fornecedores!$A$2:$B$17,2,FALSE)","v":506749495},32,"Pilkington","410 670 16 01",1037,"CBM",{"$f":"VLOOKUP(U7,Fornecedores!$A$2:$B$17,2,FALSE)","v":"B85631083"},33,"MB","A4106701601",1330]
["Parabrisas","002132637",null,"002130193","002131001",null,"NASACAR",{"$f":"VLOOKUP(G8,Fornecedores!$A$2:$B$17,2,FALSE)","v":500615250},31,"STARGLASS","0809289/22540",665,"2025-01-20","2026-01-20"]
["Parabrisas","002157147\n002134195","002133031",null,null,null,"NASACAR",{"$f":"VLOOKUP(G9,Fornecedores!$A$2:$B$17,2,FALSE)","v":500615250},31,"STARGLASS","0834562/22540",755,"2025-01-20","2026-01-20","CBM",{"$f":"VLOOKUP(O9,Fornecedores!$A$2:$B$17,2,FALSE)","v":"B85631083"},32,"finnlamex","D9413144",770,"EXPRESSGLASS",{"$f":"VLOOKUP(U9,Fornecedores!$A$2:$B$17,2,FALSE)","v":506749495},33,"Pilkington","410 670 63 01",924.1]
["Parabrisas","002133619",null,"002130417","002130771",null,"NASACAR",{"$f":"VLOOKUP(G10,Fornecedores!$A$2:$B$17,2,FALSE)","v":500615250},31,"STARGLASS","0809207/22540",660,"2025-01-20","2026-01-20","CBM",{"$f":"VLOOKUP(O10,Fornecedores!$A$2:$B$17,2,FALSE)","v":"B85631083"},32,"Pilkington","D94094038",660]
["Parabrisas","002133585",null,"002131340","002131423",null,"NASACAR",{"$f":"VLOOKUP(G11,Fornecedores!$A$2:$B$17,2,FALSE)","v":500615250},31,"STARGLASS","0820390/22540",750,"2025-01-20","2026-01-20","CBM",{"$f":"VLOOKUP(O11,Fornecedores!$A$2:$B$17,2,FALSE)","v":"B85631083"},32,"Pilkington","D9390240",805,"EXPRESSGLASS",{"$f":"VLOOKUP(U11,Fornecedores!$A$2:$B$17,2,FALSE)","v":506749495},33,"Pilkington","633 671 00 10",833.3]
["Parabrisas","002132611",null,null,null,null,"NASACAR",{"$f":"VLOOKUP(G12,Fornecedores!$A$2:$B$17,2,FALSE)","v":500615250},31,"STRAGLASS","0809056/22540",700,"2025-01-20","2026-01-20","CBM",{"$f":"VLOOKUP(O12,Fornecedores!$A$2:$B$17,2,FALSE)","v":"B85631083"},32,"Pilkington","D9390240",860,"EXPRESSGLASS",{"$f":"VLOOKUP(U12,Fornecedores!$A$2:$B$17,2,FALSE)","v":506749495},33,"Pilkington","632 671 00 10",1116.7]
["Parabrisas","002133270",null,"002170546",null,null,"NASACAR",{"$f":"VLOOKUP(G13,Fornecedores!$A$2:$B$17,2,FALSE)","v":500615250},31,"STRAGLASS","0809266/22540",715,"2025-01-20","2026-01-20","CBM",{"$f":"VLOOKUP(O13,Fornecedores!$A$2:$B$17,2,FALSE)","v":"B85631083"},32,"finnlamex","D9403599",749.5,"EXPRESSGLASS",{"$f":"VLOOKUP(U13,Fornecedores!$A$2:$B$17,2,FALSE)","v":506749495},33,"Pilkington","592414",883.3]
["Parabrisas",null,null,"002131555",null,null,"NASACAR",{"$f":"VLOOKUP(G14,Fornecedores!$A$2:$B$17,2,FALSE)","v":500615250},31,"STRAGLASS","0835316/22540",675,"2025-01-20","2026-01-20","CBM",{"$f":"VLOOKUP(O14,Fornecedores!$A$2:$B$17,2,FALSE)","v":"B85631083"},32,"MERCEDES","A6326710010",1360]
["Parabrisas","002133288",null,null,"002131506",null,"CBM",{"$f":"VLOOKUP(G15,Fornecedores!$A$2:$B$17,2,FALSE)","v":"B85631083"},31,"finnlamex","D9404361",617.4,"2025-01-20","2026-01-20","NASACAR",{"$f":"VLOOKUP(O15,Fornecedores!$A$2:$B$17,2,FALSE)","v":500615250},32,"STRAGLASS","0801647/22540",645]
["Parabrisas","002131134",null,"002131464",null,null,"CBM",{"$f":"VLOOKUP(G16,Fornecedores!$A$2:$B$17,2,FALSE)","v":"B85631083"},31,"Pilkington","D9297005",660,"2025-01-20","2026-01-20","NASACAR",{"$f":"VLOOKUP(O16,Fornecedores!$A$2:$B$17,2,FALSE)","v":500615250},32,"STRAGLASS","0811052/22540",798,"EXPRESSGLASS",{"$f":"VLOOKUP(U16,Fornecedores!$A$2:$B$17,2,FALSE)","v":506749495},33,"Pilkington","88751010902",911.7]
["Parabrisas","002157220",null,null,null,null,"CBM",{"$f":"VLOOKUP(G17,Fornecedores!$A$2:$B$17,2,FALSE)","v":"B85631083"},31,"MERCEDES","A4106705510",1550,"2025-01-20","2026-01-20"]
["Parabrisas","002133593",null,null,null,null,null,null,31,null,null,null,"2025-01-20","2026-01-20"]
["Parabrisas",null,null,null,"002131084",null,"NASACAR",{"$f":"VLOOKUP(G19,Fornecedores!$A$2:$B$17,2,FALSE)","v":500615250},31,"STRAGLASS","0801113/22540",660,"2025-01-20","2026-01-20"]
["Parabrisas",null,null,"004232328",null,null,"CBM",{"$f":"VLOOKUP(G20,Fornecedores!$A$2:$B$17,2,FALSE)","v":"B85631083"},31,"finnlamex","D9507662",966,"2025-01-20","2026-01-20","NASACAR",{"$f":"VLOOKUP(O20,Fornecedores!$A$2:$B$17,2,FALSE)","v":500615250},32,"TERGLASS","0823701/33191",1840]
["Parabrisas","002132900",null,null,null,null,"NASACAR",{"$f":"VLOOKUP(G21,Fornecedores!$A$2:$B$17,2,FALSE)","v":500615250},31,"SAINT-GOBAIN","0809466/167",1190,"2025-01-20","2026-01-20","CBM",{"$f":"VLOOKUP(O21,Fornecedores!$A$2:$B$17,2,FALSE)","v":"B85631083"},32,"MERCEDES","A6326710310",1480,"EXPRESSGLASS",{"$f":"VLOOKUP(U21,Fornecedores!$A$2:$B$17,2,FALSE)","v":506749495},33,"Pilkington","632 671 03 10",1566.7]
["Parabrisas",null,null,null,null,null,"NASACAR",{"$f":"VLOOKUP(G22,Fornecedores!$A$2:$B$17,2,FALSE)","v":500615250},31,"STARGLASS","0834562/22540",760,"2025-01-20","2026-01-20","CBM",{"$f":"VLOOKUP(O22,Fornecedores!$A$2:$B$17,2,FALSE)","v":"B85631083"},32,"finnlamex","D9413144",770,"EXPRESSGLASS",{"$f":"VLOOKUP(U22,Fornecedores!$A$2:$B$17,2,FALSE)","v":506749495},33,"Pilkington","410 670 63 01",988.6]
["Parabrisas","004592275",null,null,null,null,"CBM",{"$f":"VLOOKUP(G23,Fornecedores!$A$2:$B$17,2,FALSE)","v":"B85631083"},31,"finnlamex","D9404591",465,"2025-01-20","2026-01-20","NASACAR",{"$f":"VLOOKUP(O23,Fornecedores!$A$2:$B$17,2,FALSE)","v":500615250},32,"TERGLASS","0823026/33191",710]
["Parabrisas",null,null,null,"002131118",null,"NASACAR",{"$f":"VLOOKUP(G24,Fornecedores!$A$2:$B$17,2,FALSE)","v":500615250},31,"STARGLASS","0801113/22540",660,"2025-01-20","2026-01-20","CBM",{"$f":"VLOOKUP(O24,Fornecedores!$A$2:$B$17,2,FALSE)","v":"B85631083"},32,"Pilkington","D9193098",672]
["Oculo Traseiro","002157113","002133056",null,null,null,"CBM",{"$f":"VLOOKUP(G25,Fornecedores!$A$2:$B$17,2,FALSE)","v":"B85631083"},31,"MERCEDES","D9414252",700.5,"2025-01-20","2026-01-20"]
["Oculo Traseiro","002133098",null,"002190379","002131167",null,"EXPRESSGLASS",{"$f":"VLOOKUP(G26,Fornecedores!$A$2:$B$17,2,FALSE)","v":506749495},31,"Pilkington","633 678 00 10",336.1,"2025-01-20","2026-01-20","NASACAR",{"$f":"VLOOKUP(O26,Fornecedores!$A$2:$B$17,2,FALSE)","v":500615250},32,"TERGLASS","0828050/33191",460,"CBM",{"$f":"VLOOKUP(U26,Fornecedores!$A$2:$B$17,2,FALSE)","v":"B85631083"},33,"MB","D9392246",720.3]
["Oculo Traseiro",null,null,"002132215",null,null,"CBM",{"$f":"VLOOKUP(G27,Fornecedores!$A$2:$B$17,2,FALSE)","v":"B85631083"},31,"IRIZAR","D9405873",646,"2025-01-20","2026-01-20","NASACAR",{"$f":"VLOOKUP(O27,Fornecedores!$A$2:$B$17,2,FALSE)","v":500615250},32,"VIDUR","0820639/22630",898]
["Vidro divisoria interior",null,"002163178",null,null,null,"CBM",{"$f":"VLOOKUP(G28,Fornecedores!$A$2:$B$17,2,FALSE)","v":"B85631083"},31,"MERCEDES","A3947111710",490,"2025-01-20","2026-01-20"]
["Vidro janela motorista",null,"002163061",null,null,null,"CBM",{"$f":"VLOOKUP(G29,Fornecedores!$A$2:$B$17,2,FALSE)","v":"B85631083"},31,"MERCEDES","A3116708411",1690,"2025-01-20","2026-01-20"]
["Vidro janela motorista","002153740",null,null,null,null,"CBM",{"$f":"VLOOKUP(G30,Fornecedores!$A$2:$B$17,2,FALSE)","v":"B85631083"},31,"CBM PART","D9413599",554,"2025-01-20","2026-01-20"]
["Vidro lateral","002134088",null,null,null,null,null,null,31,null,null,null,"2025-01-20","2026-01-20"]
["Vidro lateral","002155596",null,null,null,null,"CBM",{"$f":"VLOOKUP(G32,Fornecedores!$A$2:$B$17,2,FALSE)","v":"B85631083"},31,"CBM PART","D9411173",748,"2025-01-20","2026-01-20"]
["Vidro lateral","002155968",null,null,null,null,null,null,31,null,null,null,"2025-01-20","2026-01-20"]
["vidro porta","004596037",null,"002161081","002140069",null,"CBM",{"$f":"VLOOKUP(G34,Fornecedores!$A$2:$B$17,2,FALSE)","v":"B85631083"},31,"SAINT G","D9297535",490,"2025-01-20","2026-01-20"]
["vidro porta","002155778",null,"002170173",null,null,"NASACAR",{"$f":"VLOOKUP(G35,Fornecedores!$A$2:$B$17,2,FALSE)","v":500615250},31,"VITROPOR","0823130/1135",288,"2025-01-20","2026-01-20","CBM",{"$f":"VLOOKUP(O35,Fornecedores!$A$2:$B$17,2,FALSE)","v":"B85631083"},32,"SAINT G","D9297536",620]
["vidro porta","002143022",null,null,null,null,"CBM",{"$f":"VLOOKUP(G36,Fornecedores!$A$2:$B$17,2,FALSE)","v":"B85631083"},31,"MERCEDES","A6446734406",490,"2025-01-20","2026-01-20"]
["vidro porta","002157139",null,null,null,null,"CBM",{"$f":"VLOOKUP(G37,Fornecedores!$A$2:$B$17,2,FALSE)","v":"B85631083"},31,"MERCEDES","A4107351110",290,"2025-01-20","2026-01-20"]

{"sheet":"Fornecedores","index":4,"n_rows":17,"n_cols":12,"rows_kept":17,"cut":false,"hidden":false,"merged":[[0,2,0,3],[0,4,0,5],[0,6,0,7],[0,8,0,9],[0,10,0,11]]}
["Nome","NIF","BT",null,"RL",null,"Universo Algarve",null,"Universo Alentejo",null,"Universo Tejo"]
["NASACAR",500615250,22511,20082,22511," 06657 ",22511," 00991",2254," 04483",22511," 21677"]
["NORS",500662860,22511,49365,22511,10004,22511," 39064",2254," 04516",22511," 22998"]
["COPEROL",502021160,22511,15456,22511," 10000",22511," 00293 ",2254," 01504",22511,"20438 "]
["KRAULTI",502271450,22511,20213,22511,"08024",22511,"0017",2254,"03627",22511,21655]
["GLOBAL P",509436722,22511,49333,22511," 09997",22511," 01635",22511,49333,22511,49333]
["MOTORBUS",503500992,22511,16366,22511,8679,22511," 01499",2254," 04363",22511," 22040"]
["TECNIAMPER",501948775,22511,14471,22511,"07215 ",22511," 01371",2254,"06210 ",22511," 22155"]
["CBM","B85631083",22512,30052,22511,"09403 ",22512,"09403",22512,"09403",22512," 30371"]
["EUROPART",503791970,22511,16559,22511," 08718",22511,386,2254," 02112",22511," 20639"]
["EXPRESSGLASS",506749495,22511,17910,22511,"02143",22511,"02143",2254,"02143",22511,"02143"]
["CARBUS",503801461,22511,15202,22511," 08654",22511," 03807 ",2254," 01030",22511," 20460"]
["IM",500952981,22511,15049,22511,"08251 ",22511,"00526",2254," 03122",22511," 21114"]
["AGT",501276343,22511,14691,22511," 09870",22511," 03145",2254," 00298",22511," 20120"]
["ATLASBUS","B27739879",22512,48746,22512," 08782",22512,48746,2255," 00102",25112,48746]
["HYDRAPLAN",507448979,22511,30131,22511,"08935",22511,"00466",2254,"02920",22511,21102]
["DAIMLER TR",516853252,22511,49398,22511,10011,22511,"00348",2254,"01468",22511,24153]

{"sheet":"Input","index":5,"n_rows":8,"n_cols":8,"rows_kept":8,"cut":false,"hidden":false,"merged":[]}
[]
[null,"Nome Concurso","CP10.2024","Parabrisas"]
[null,"Base Cod. Fornecedores","BT","RL","Universo Algarve","Universo Alentejo","Universo Tejo","Universo Tejo"]
[null,"Empresas","BT","RL","EVA","RA","RT","ROeste"]
[null,"Cod. Empresas",10,16,9,8,4,84]
[null,"Nº Empresas AS400",5,"começa na col","B",{"$f":"COLUMN(INDIRECT(E6&\"1\"))","v":2}]
[null,"Ref. Peças AS400","BT","RL","EVA","RA","TEJO","TEJO"]
[null,"Dimensão Propostas",6,"colunas"]