{"text_format":"1","workbook":"xlsx","n_sheets":6,"sheets":["RefParts II","RefParts","Fornecedores II","CP10.2024","Fornecedores","Input"],"not_rendered":{"charts":0,"images":1,"macros":1,"external_links":0,"defined_names":3,"comments":0,"pivot_tables":0},"unopened":[],"bounds":{"document_bytes":16777216,"sheet_cells":100000,"rows_first":2000,"rows_last":500,"rows_between":2000,"halvings":0,"cell_chars":16384,"cell_head_chars":4096},"cells_cut":0,"cells_raw":0,"read":"whole","date_system":"1900"}

{"sheet":"RefParts II","index":0,"n_rows":125,"n_cols":12,"rows_kept":125,"cut":false,"hidden":false,"merged":[]}
["Ref Acordo","Nome Acordo","Empresa","Descrição Peça","CAE","Fornecedor","CFE","Marca Modelo","VUnit","Acordo","Data I","Data F"]
["CP10.2024.00001","CP10.2024: Parabrisas","BT","Parabrisas","002133031.10","NASACAR","20082.10","STARGLASS: 0809497/22540",608,"Acordo","2025-01-20","2026-01-20"]
["CP10.2024.00001","CP10.2024: Parabrisas","BT","Parabrisas","002133031.10","EXPRESSGLASS","17910.10","Pilkington: 632 671 19 10",774.1,"Alternativa 1","2025-01-20","2026-01-20"]
["CP10.2024.00001","CP10.2024: Parabrisas","BT","Parabrisas","002133031.10","CBM","30052.10","MB: A6326711910",980,"Alternativa 2","2025-01-20","2026-01-20"]
["CP10.2024.00002","CP10.2024: Parabrisas","BT","Parabrisas","002133635.10","NASACAR","20082.10","STARGLASS: 0820450/22250",802,"Acordo","2025-01-20","2026-01-20"]
["CP10.2024.00002","CP10.2024: Parabrisas","BT","Parabrisas","002133635.10","EXPRESSGLASS","17910.10","Pilkington: 632 670 15 01",842.3,"Alternativa 1","2025-01-20","2026-01-20"]
["CP10.2024.00002","CP10.2024: Parabrisas","BT","Parabrisas","002133635.10","CBM","30052.10","Pilkington: D9502084",868,"Alternativa 2","2025-01-20","2026-01-20"]
["CP10.2024.00003","CP10.2024: Parabrisas","BT","Parabrisas","002134013.10","NASACAR","20082.10","TERGLASS: 0834242/22540",810,"Acordo","2025-01-20","2026-01-20"]
["CP10.2024.00003","CP10.2024: Parabrisas","BT","Parabrisas","002134013.10","CBM","30052.10","finnlamex: D9413654",994,"Alternativa 1","2025-01-20","2026-01-20"]
["CP10.2024.00003","CP10.2024: Parabrisas","BT","Parabrisas","002134013.10","EXPRESSGLASS","17910.10","Pilkington: 410 670 40 01",1144.3,"Alternativa 2","2025-01-20","2026-01-20"]
["CP10.2024.00004","CP10.2024: Parabrisas","BT","Parabrisas","002132678.10","NASACAR","20082.10","STARGLASS: 0809136/22540",480,"Acordo","2025-01-20","2026-01-20"]
["CP10.2024.00004","CP10.2024: Parabrisas","BT","Parabrisas","002132678.10","CBM","30052.10","finnlamex: D9403411",599.20000000000005,"Alternativa 1","2025-01-20","2026-01-20"]
["CP10.2024.00004","CP10.2024: Parabrisas","BT","Parabrisas","002132678.10","EXPRESSGLASS","17910.10","Pilkington: 592009",826.9,"Alternativa 2","2025-01-20","2026-01-20"]
["CP10.2024.00005","CP10.2024: Parabrisas","BT","Parabrisas","002133809.10","NASACAR","20082.10","STARGLASS: 0833073/22540",810,"Acordo","2025-01-20","2026-01-20"]
["CP10.2024.00005","CP10.2024: Parabrisas","BT","Parabrisas","002133809.10","EXPRESSGLASS","17910.10","Pilkington: 410 670 16 01",1037,"Alternativa 1","2025-01-20","2026-01-20"]
["CP10.2024.00005","CP10.2024: Parabrisas","BT","Parabrisas","002133809.10","CBM","30052.10","MB: A4106701601",1330,"Alternativa 2","2025-01-20","2026-01-20"]
["CP10.2024.00006","CP10.2024: Parabrisas","BT","Parabrisas","002132637.10","NASACAR","20082.10","STARGLASS: 0809289/22540",665,"Acordo","2025-01-20","2026-01-20"]
["CP10.2024.00007","CP10.2024: Parabrisas","BT","Parabrisas","002157147.10","NASACAR","20082.10","STARGLASS: 0834562/22540",755,"Acordo","2025-01-20","2026-01-20"]
["CP10.2024.00007","CP10.2024: Parabrisas","BT","Parabrisas","002157147.10","CBM","30052.10","finnlamex: D9413144",770,"Alternativa 1","2025-01-20","2026-01-20"]
["CP10.2024.00007","CP10.2024: Parabrisas","BT","Parabrisas","002157147.10","EXPRESSGLASS","17910.10","Pilkington: 410 670 63 01",924.1,"Alternativa 2","2025-01-20","2026-01-20"]
["CP10.2024.00007","CP10.2024: Parabrisas","BT","Parabrisas","002134195.10","NASACAR","20082.10","STARGLASS: 0834562/22540",755,"Acordo","2025-01-20","2026-01-20"]
["CP10.2024.00007","CP10.2024: Parabrisas","BT","Parabrisas","002134195.10","CBM","30052.10","finnlamex: D9413144",770,"Alternativa 1","2025-01-20","2026-01-20"]
["CP10.2024.00007","CP10.2024: Parabrisas","BT","Parabrisas","002134195.10","EXPRESSGLASS","17910.10","Pilkington: 410 670 63 01",924.1,"Alternativa 2","2025-01-20","2026-01-20"]
["CP10.2024.00008","CP10.2024: Parabrisas","BT","Parabrisas","002133619.10","NASACAR","20082.10","STARGLASS: 0809207/22540",660,"Acordo","2025-01-20","2026-01-20"]
["CP10.2024.00008","CP10.2024: Parabrisas","BT","Parabrisas","002133619.10","CBM","30052.10","Pilkington: D94094038",660,"Alternativa 1","2025-01-20","2026-01-20"]
["CP10.2024.00009","CP10.2024: Parabrisas","BT","Parabrisas","002133585.10","NASACAR","20082.10","STARGLASS: 0820390/22540",750,"Acordo","2025-01-20","2026-01-20"]
["CP10.2024.00009","CP10.2024: Parabrisas","BT","Parabrisas","002133585.10","CBM","30052.10","Pilkington: D9390240",805,"Alternativa 1","2025-01-20","2026-01-20"]
["CP10.2024.00009","CP10.2024: Parabrisas","BT","Parabrisas","002133585.10","EXPRESSGLASS","17910.10","Pilkington: 633 671 00 10",833.3,"Alternativa 2","2025-01-20","2026-01-20"]
["CP10.2024.00010","CP10.2024: Parabrisas","BT","Parabrisas","002132611.10","NASACAR","20082.10","STRAGLASS: 0809056/22540",700,"Acordo","2025-01-20","2026-01-20"]
["CP10.2024.00010","CP10.2024: Parabrisas","BT","Parabrisas","002132611.10","CBM","30052.10","Pilkington: D9390240",860,"Alternativa 1","2025-01-20","2026-01-20"]
{"$rows_left_out":96}
{"sheet":"RefParts","index":1,"n_rows":59,"n_cols":19,"rows_kept":59,"cut":false,"hidden":false,"merged":[]}
["Ref Acordo","Nome Acordo","Empresa","Descrição Peça","CAE","Acodro: Fornecedor","Acordo: CFE","Acordo: Marca Modelo","Acordo: VUnit","Acordo: Data I","Acordo: Data F","Alt1: Fornecedor","Alt1: CFE","Alt1: Marca Modelo","Alt1: VUnit","Alt2: Fornecedor","Alt2: CFE","Alt2: Marca Modelo","Alt2: VUnit"]
["CP10.2024.00001","CP10.2024: Parabrisas","BT","Parabrisas","002133031.10","NASACAR","20082.10","STARGLASS: 0809497/22540",608,"2025-01-20","2026-01-20","EXPRESSGLASS","17910.10","Pilkington: 632 671 19 10",774.1,"CBM","30052.10","MB: A6326711910",980]
["CP10.2024.00002","CP10.2024: Parabrisas","BT","Parabrisas","002133635.10","NASACAR","20082.10","STARGLASS: 0820450/22250",802,"2025-01-20","2026-01-20","EXPRESSGLASS","17910.10","Pilkington: 632 670 15 01",842.3,"CBM","30052.10","Pilkington: D9502084",868]
["CP10.2024.00003","CP10.2024: Parabrisas","BT","Parabrisas","002134013.10","NASACAR","20082.10","TERGLASS: 0834242/22540",810,"2025-01-20","2026-01-20","CBM","30052.10","finnlamex: D9413654",994,"EXPRESSGLASS","17910.10","Pilkington: 410 670 40 01",1144.3]
["CP10.2024.00004","CP10.2024: Parabrisas","BT","Parabrisas","002132678.10","NASACAR","20082.10","STARGLASS: 0809136/22540",480,"2025-01-20","2026-01-20","CBM","30052.10","finnlamex: D9403411",599.20000000000005,"EXPRESSGLASS","17910.10","Pilkington: 592009",826.9]
["CP10.2024.00005","CP10.2024: Parabrisas","BT","Parabrisas","002133809.10","NASACAR","20082.10","STARGLASS: 0833073/22540",810,"2025-01-20","2026-01-20","EXPRESSGLASS","17910.10","Pilkington: 410 670 16 01",1037,"CBM","30052.10","MB: A4106701601",1330]
["CP10.2024.00006","CP10.2024: Parabrisas","BT","Parabrisas","002132637.10","NASACAR","20082.10","STARGLASS: 0809289/22540",665,"2025-01-20","2026-01-20"]
["CP10.2024.00007","CP10.2024: Parabrisas","BT","Parabrisas","002157147.10","NASACAR","20082.10","STARGLASS: 0834562/22540",755,"2025-01-20","2026-01-20","CBM","30052.10","finnlamex: D9413144",770,"EXPRESSGLASS","17910.10","Pilkington: 410 670 63 01",924.1]
["CP10.2024.00007","CP10.2024: Parabrisas","BT","Parabrisas","002134195.10","NASACAR","20082.10","STARGLASS: 0834562/22540",755,"2025-01-20","2026-01-20","CBM","30052.10","finnlamex: D9413144",770,"EXPRESSGLASS","17910.10","Pilkington: 410 670 63 01",924.1]
["CP10.2024.00008","CP10.2024: Parabrisas","BT","Parabrisas","002133619.10","NASACAR","20082.10","STARGLASS: 0809207/22540",660,"2025-01-20","2026-01-20","CBM","30052.10","Pilkington: D94094038",660]
["CP10.2024.00009","CP10.2024: Parabrisas","BT","Parabrisas","002133585.10","NASACAR","20082.10","STARGLASS: 0820390/22540",750,"2025-01-20","2026-01-20","CBM","30052.10","Pilkington: D9390240",805,"EXPRESSGLASS","17910.10","Pilkington: 633 671 00 10",833.3]
["CP10.2024.00010","CP10.2024: Parabrisas","BT","Parabrisas","002132611.10","NASACAR","20082.10","STRAGLASS: 0809056/22540",700,"2025-01-20","2026-01-20","CBM","30052.10","Pilkington: D9390240",860,"EXPRESSGLASS","17910.10","Pilkington: 632 671 00 10",1116.7]
["CP10.2024.00011","CP10.2024: Parabrisas","BT","Parabrisas","002133270.10","NASACAR","20082.10","STRAGLASS: 0809266/22540",715,"2025-01-20","2026-01-20","CBM","30052.10","finnlamex: D9403599",749.5,"EXPRESSGLASS","17910.10","Pilkington: 592414",883.3]
["CP10.2024.00013","CP10.2024: Parabrisas","BT","Parabrisas","002133288.10","CBM","30052.10","finnlamex: D9404361",617.4,"2025-01-20","2026-01-20","NASACAR","20082.10","STRAGLASS: 0801647/22540",645]
["CP10.2024.00014","CP10.2024: Parabrisas","BT","Parabrisas","002131134.10","CBM","30052.10","Pilkington: D9297005",660,"2025-01-20","2026-01-20","NASACAR","20082.10","STRAGLASS: 0811052/22540",798,"EXPRESSGLASS","17910.10","Pilkington: 88751010902",911.7]
["CP10.2024.00015","CP10.2024: Parabrisas","BT","Parabrisas","002157220.10","CBM","30052.10","MERCEDES: A4106705510",1550,"2025-01-20","2026-01-20"]
["CP10.2024.00016","CP10.2024: Parabrisas","BT","Parabrisas","002133593.10",null,null,": ",null,"2025-01-20","2026-01-20"]
["CP10.2024.00019","CP10.2024: Parabrisas","BT","Parabrisas","002132900.10","NASACAR","20082.10","SAINT-GOBAIN: 0809466/167",1190,"2025-01-20","2026-01-20","CBM","30052.10","MERCEDES: A6326710310",1480,"EXPRESSGLASS","17910.10","Pilkington: 632 671 03 10",1566.7]
["CP10.2024.00021","CP10.2024: Parabrisas","BT","Parabrisas","004592275.10","CBM","30052.10","finnlamex: D9404591",465,"2025-01-20","2026-01-20","NASACAR","20082.10","TERGLASS: 0823026/33191",710]
["CP10.2024.00023","CP10.2024: Parabrisas","BT","Oculo Traseiro","002157113.10","CBM","30052.10","MERCEDES: D9414252",700.5,"2025-01-20","2026-01-20"]
["CP10.2024.00024","CP10.2024: Parabrisas","BT","Oculo Traseiro","002133098.10","EXPRESSGLASS","17910.10","Pilkington: 633 678 00 10",336.1,"2025-01-20","2026-01-20","NASACAR","20082.10","TERGLASS: 0828050/33191",460,"CBM","30052.10","MB: D9392246",720.3]
["CP10.2024.00028","CP10.2024: Parabrisas","BT","Vidro janela motorista","002153740.10","CBM","30052.10","CBM PART: D9413599",554,"2025-01-20","2026-01-20"]
["CP10.2024.00029","CP10.2024: Parabrisas","BT","Vidro lateral","002134088.10",null,null,": ",null,"2025-01-20","2026-01-20"]
["CP10.2024.00030","CP10.2024: Parabrisas","BT","Vidro lateral","002155596.10","CBM","30052.10","CBM PART: D9411173",748,"2025-01-20","2026-01-20"]
["CP10.2024.00031","CP10.2024: Parabrisas","BT","Vidro lateral","002155968.10",null,null,": ",null,"2025-01-20","2026-01-20"]
["CP10.2024.00032","CP10.2024: Parabrisas","BT","vidro porta","004596037.10","CBM","30052.10","SAINT G: D9297535",490,"2025-01-20","2026-01-20"]
["CP10.2024.00033","CP10.2024: Parabrisas","BT","vidro porta","002155778.10","NASACAR","20082.10","VITROPOR: 0823130/1135",288,"2025-01-20","2026-01-20","CBM","30052.10","SAINT G: D9297536",620]
["CP10.2024.00034","CP10.2024: Parabrisas","BT","vidro porta","002143022.10","CBM","30052.10","MERCEDES: A6446734406",490,"2025-01-20","2026-01-20"]
["CP10.2024.00035","CP10.2024: Parabrisas","BT","vidro porta","002157139.10","CBM","30052.10","MERCEDES: A4107351110",290,"2025-01-20","2026-01-20"]
["CP10.2024.00007","CP10.2024: Parabrisas","RL","Parabrisas","002133031.16","NASACAR"," 06657 .16","STARGLASS: 0834562/22540",755,"2025-01-20","2026-01-20","CBM","09403 .16","finnlamex: D9413144",770,"EXPRESSGLASS","02143.16","Pilkington: 410 670 63 01",924.1]
{"$rows_left_out":30}
{"sheet":"Fornecedores II","index":2,"n_rows":97,"n_cols":4,"rows_kept":97,"cut":false,"hidden":false,"merged":[]}
["Empresa","Nome","CFE","NIF"]
["BT","NASACAR","20082.10",500615250]
["BT","NORS","49365.10",500662860]
["BT","COPEROL","15456.10",502021160]
["BT","KRAULTI","20213.10",502271450]
["BT","GLOBAL P","49333.10",509436722]
["BT","MOTORBUS","16366.10",503500992]
["BT","TECNIAMPER","14471.10",501948775]
["BT","CBM","30052.10","B85631083"]
["BT","EUROPART","16559.10",503791970]
["BT","EXPRESSGLASS","17910.10",506749495]
["BT","CARBUS","15202.10",503801461]
["BT","IM","15049.10",500952981]
["BT","AGT","14691.10",501276343]
["BT","ATLASBUS","48746.10","B27739879"]
["BT","HYDRAPLAN","30131.10",507448979]
["BT","DAIMLER TR","49398.10",516853252]
["RL","NASACAR"," 06657 .16",500615250]
["RL","NORS","10004.16",500662860]
["RL","COPEROL"," 10000.16",502021160]
["RL","KRAULTI","08024.16",502271450]
["RL","GLOBAL P"," 09997.16",509436722]
["RL","MOTORBUS","8679.16",503500992]
["RL","TECNIAMPER","07215 .16",501948775]
["RL","CBM","09403 .16","B85631083"]
["RL","EUROPART"," 08718.16",503791970]
["RL","EXPRESSGLASS","02143.16",506749495]
["RL","CARBUS"," 08654.16",503801461]
["RL","IM","08251 .16",500952981]
["RL","AGT"," 09870.16",501276343]
{"$rows_left_out":68}
{"sheet":"CP10.2024","index":3,"n_rows":37,"n_cols":32,"rows_kept":37,"cut":false,"hidden":false,"merged":[[0,1,0,5],[0,6,0,13],[0,14,0,31]]}
[null,"Códigos dos artigos por empresa",null,null,null,null,"Condições a carregar no arcodo",null,null,null,null,null,null,null,"Outras ordens a criar nos artigos além da do acordo"]
["Descrição","BT","RL","EVA","RA","TEJO","FORNECEDOR","NIF","ordem","Marca","Referência","P Un","Data inicio","Data de fim","FORNECEDOR","NIF","ordem","Marca","Referência","P Un","FORNECEDOR","NIF","ordem","Marca","Referência","P Un","FORNECEDOR","NIF","ordem","Marca","Referência","P Un"]
["Parabrisas","002133031",null,"002131423","002131092",null,"NASACAR",{"$f":"VLOOKUP(G3,Fornecedores!A2:B17,2,FALSE)","v":500615250},31,"STARGLASS","0809497/22540",608,"2025-01-20","2026-01-20","EXPRESSGLASS",{"$f":"VLOOKUP(O3,Fornecedores!$A$2:$B$17,2,FALSE)","v":506749495},32,"Pilkington","632 671 19 10",774.1,"CBM",{"$f":"VLOOKUP(U3,Fornecedores!$A$2:$B$17,2,FALSE)","v":"B85631083"},33,"MB","A6326711910",980]
["Parabrisas","002133635",null,"002152767","002131175",null,"NASACAR",{"$f":"VLOOKUP(G4,Fornecedores!$A$2:$B$17,2,FALSE)","v":500615250},31,"STARGLASS","0820450/22250",802,"2025-01-20","2026-01-20","EXPRESSGLASS",{"$f":"VLOOKUP(O4,Fornecedores!$A$2:$B$17,2,FALSE)","v":506749495},32,"Pilkington","632 670 15 01",842.3,"CBM",{"$f":"VLOOKUP(U4,Fornecedores!$A$2:$B$17,2,FALSE)","v":"B85631083"},33,"Pilkington","D9502084",868]
["Parabrisas","002134013",null,null,null,null,"NASACAR",{"$f":"VLOOKUP(G5,Fornecedores!$A$2:$B$17,2,FALSE)","v":500615250},31,"TERGLASS","0834242/22540",810,"2025-01-20","2026-01-20","CBM",{"$f":"VLOOKUP(O5,Fornecedores!$A$2:$B$17,2,FALSE)","v":"B85631083"},32,"finnlamex","D9413654",994,"EXPRESSGLASS",{"$f":"VLOOKUP(U5,Fornecedores!$A$2:$B$17,2,FALSE)","v":506749495},33,"Pilkington","410 670 40 01",1144.3]
["Parabrisas","002132678",null,"002140648","002130938",null,"NASACAR",{"$f":"VLOOKUP(G6,Fornecedores!$A$2:$B$17,2,FALSE)","v":500615250},31,"STARGLASS","0809136/22540",480,"2025-01-20","2026-01-20","CBM",{"$f":"VLOOKUP(O6,Fornecedores!$A$2:$B$17,2,FALSE)","v":"B85631083"},32,"finnlamex","D9403411",599.20000000000005,"EXPRESSGLASS",{"$f":"VLOOKUP(U6,Fornecedores!$A$2:$B$17,2,FALSE)","v":506749495},33,"Pilkington","592009",826.9]
["Parabrisas","002133809",null,"002131605",null,null,"NASACAR",{"$f":"VLOOKUP(G7,Fornecedores!$A$2:$B$17,2,FALSE)","v":500615250},31,"STARGLASS","0833073/22540",810,"2025-01-20","2026-01-20","EXPRESSGLASS",{"$f":"VLOOKUP(O7,Fornecedores!$A$2:$B$17,2,FALSE)","v":506749495},32,"Pilkington","410 670 16 01",1037,"CBM",{"$f":"VLOOKUP(U7,Fornecedores!$A$2:$B$17,2,FALSE)","v":"B85631083"},33,"MB","A4106701601",1330]
["Parabrisas","002132637",null,"002130193","002131001",null,"NASACAR",{"$f":"VLOOKUP(G8,Fornecedores!$A$2:$B$17,2,FALSE)","v":500615250},31,"STARGLASS","0809289/22540",665,"2025-01-20","2026-01-20"]
["Parabrisas","002157147\n002134195","002133031",null,null,null,"NASACAR",{"$f":"VLOOKUP(G9,Fornecedores!$A$2:$B$17,2,FALSE)","v":500615250},31,"STARGLASS","0834562/22540",755,"2025-01-20","2026-01-20","CBM",{"$f":"VLOOKUP(O9,Fornecedores!$A$2:$B$17,2,FALSE)","v":"B85631083"},32,"finnlamex","D9413144",770,"EXPRESSGLASS",{"$f":"VLOOKUP(U9,Fornecedores!$A$2:$B$17,2,FALSE)","v":506749495},33,"Pilkington","410 670 63 01",924.1]
["Parabrisas","002133619",null,"002130417","002130771",null,"NASACAR",{"$f":"VLOOKUP(G10,Fornecedores!$A$2:$B$17,2,FALSE)","v":500615250},31,"STARGLASS","0809207/22540",660,"2025-01-20","2026-01-20","CBM",{"$f":"VLOOKUP(O10,Fornecedores!$A$2:$B$17,2,FALSE)","v":"B85631083"},32,"Pilkington","D94094038",660]
["Parabrisas","002133585",null,"002131340","002131423",null,"NASACAR",{"$f":"VLOOKUP(G11,Fornecedores!$A$2:$B$17,2,FALSE)","v":500615250},31,"STARGLASS","0820390/22540",750,"2025-01-20","2026-01-20","CBM",{"$f":"VLOOKUP(O11,Fornecedores!$A$2:$B$17,2,FALSE)","v":"B85631083"},32,"Pilkington","D9390240",805,"EXPRESSGLASS",{"$f":"VLOOKUP(U11,Fornecedores!$A$2:$B$17,2,FALSE)","v":506749495},33,"Pilkington","633 671 00 10",833.3]
["Parabrisas","002132611",null,null,null,null,"NASACAR",{"$f":"VLOOKUP(G12,Fornecedores!$A$2:$B$17,2,FALSE)","v":500615250},31,"STRAGLASS","0809056/22540",700,"2025-01-20","2026-01-20","CBM",{"$f":"VLOOKUP(O12,Fornecedores!$A$2:$B$17,2,FALSE)","v":"B85631083"},32,"Pilkington","D9390240",860,"EXPRESSGLASS",{"$f":"VLOOKUP(U12,Fornecedores!$A$2:$B$17,2,FALSE)","v":506749495},33,"Pilkington","632 671 00 10",1116.7]
["Parabrisas","002133270",null,"002170546",null,null,"NASACAR",{"$f":"VLOOKUP(G13,Fornecedores!$A$2:$B$17,2,FALSE)","v":500615250},31,"STRAGLASS","0809266/22540",715,"2025-01-20","2026-01-20","CBM",{"$f":"VLOOKUP(O13,Fornecedores!$A$2:$B$17,2,FALSE)","v":"B85631083"},32,"finnlamex","D9403599",749.5,"EXPRESSGLASS",{"$f":"VLOOKUP(U13,Fornecedores!$A$2:$B$17,2,FALSE)","v":506749495},33,"Pilkington","592414",883.3]
["Parabrisas",null,null,"002131555",null,null,"NASACAR",{"$f":"VLOOKUP(G14,Fornecedores!$A$2:$B$17,2,FALSE)","v":500615250},31,"STRAGLASS","0835316/22540",675,"2025-01-20","2026-01-20","CBM",{"$f":"VLOOKUP(O14,Fornecedores!$A$2:$B$17,2,FALSE)","v":"B85631083"},32,"MERCEDES","A6326710010",1360]
["Parabrisas","002133288",null,null,"002131506",null,"CBM",{"$f":"VLOOKUP(G15,Fornecedores!$A$2:$B$17,2,FALSE)","v":"B85631083"},31,"finnlamex","D9404361",617.4,"2025-01-20","2026-01-20","NASACAR",{"$f":"VLOOKUP(O15,Fornecedores!$A$2:$B$17,2,FALSE)","v":500615250},32,"STRAGLASS","0801647/22540",645]
["Parabrisas","002131134",null,"002131464",null,null,"CBM",{"$f":"VLOOKUP(G16,Fornecedores!$A$2:$B$17,2,FALSE)","v":"B85631083"},31,"Pilkington","D9297005",660,"2025-01-20","2026-01-20","NASACAR",{"$f":"VLOOKUP(O16,Fornecedores!$A$2:$B$17,2,FALSE)","v":500615250},32,"STRAGLASS","0811052/22540",798,"EXPRESSGLASS",{"$f":"VLOOKUP(U16,Fornecedores!$A$2:$B$17,2,FALSE)","v":506749495},33,"Pilkington","88751010902",911.7]
["Parabrisas","002157220",null,null,null,null,"CBM",{"$f":"VLOOKUP(G17,Fornecedores!$A$2:$B$17,2,FALSE)","v":"B85631083"},31,"MERCEDES","A4106705510",1550,"2025-01-20","2026-01-20"]
["Parabrisas","002133593",null,null,null,null,null,null,31,null,null,null,"2025-01-20","2026-01-20"]
["Parabrisas",null,null,null,"002131084",null,"NASACAR",{"$f":"VLOOKUP(G19,Fornecedores!$A$2:$B$17,2,FALSE)","v":500615250},31,"STRAGLASS","0801113/22540",660,"2025-01-20","2026-01-20"]
["Parabrisas",null,null,"004232328",null,null,"CBM",{"$f":"VLOOKUP(G20,Fornecedores!$A$2:$B$17,2,FALSE)","v":"B85631083"},31,"finnlamex","D9507662",966,"2025-01-20","2026-01-20","NASACAR",{"$f":"VLOOKUP(O20,Fornecedores!$A$2:$B$17,2,FALSE)","v":500615250},32,"TERGLASS","0823701/33191",1840]
["Parabrisas","002132900",null,null,null,null,"NASACAR",{"$f":"VLOOKUP(G21,Fornecedores!$A$2:$B$17,2,FALSE)","v":500615250},31,"SAINT-GOBAIN","0809466/167",1190,"2025-01-20","2026-01-20","CBM",{"$f":"VLOOKUP(O21,Fornecedores!$A$2:$B$17,2,FALSE)","v":"B85631083"},32,"MERCEDES","A6326710310",1480,"EXPRESSGLASS",{"$f":"VLOOKUP(U21,Fornecedores!$A$2:$B$17,2,FALSE)","v":506749495},33,"Pilkington","632 671 03 10",1566.7]
["Parabrisas",null,null,null,null,null,"NASACAR",{"$f":"VLOOKUP(G22,Fornecedores!$A$2:$B$17,2,FALSE)","v":500615250},31,"STARGLASS","0834562/22540",760,"2025-01-20","2026-01-20","CBM",{"$f":"VLOOKUP(O22,Fornecedores!$A$2:$B$17,2,FALSE)","v":"B85631083"},32,"finnlamex","D9413144",770,"EXPRESSGLASS",{"$f":"VLOOKUP(U22,Fornecedores!$A$2:$B$17,2,FALSE)","v":506749495},33,"Pilkington","410 670 63 01",988.6]
["Parabrisas","004592275",null,null,null,null,"CBM",{"$f":"VLOOKUP(G23,Fornecedores!$A$2:$B$17,2,FALSE)","v":"B85631083"},31,"finnlamex","D9404591",465,"2025-01-20","2026-01-20","NASACAR",{"$f":"VLOOKUP(O23,Fornecedores!$A$2:$B$17,2,FALSE)","v":500615250},32,"TERGLASS","0823026/33191",710]
["Parabrisas",null,null,null,"002131118",null,"NASACAR",{"$f":"VLOOKUP(G24,Fornecedores!$A$2:$B$17,2,FALSE)","v":500615250},31,"STARGLASS","0801113/22540",660,"2025-01-20","2026-01-20","CBM",{"$f":"VLOOKUP(O24,Fornecedores!$A$2:$B$17,2,FALSE)","v":"B85631083"},32,"Pilkington","D9193098",672]
["Oculo Traseiro","002157113","002133056",null,null,null,"CBM",{"$f":"VLOOKUP(G25,Fornecedores!$A$2:$B$17,2,FALSE)","v":"B85631083"},31,"MERCEDES","D9414252",700.5,"2025-01-20","2026-01-20"]
["Oculo Traseiro","002133098",null,"002190379","002131167",null,"EXPRESSGLASS",{"$f":"VLOOKUP(G26,Fornecedores!$A$2:$B$17,2,FALSE)","v":506749495},31,"Pilkington","633 678 00 10",336.1,"2025-01-20","2026-01-20","NASACAR",{"$f":"VLOOKUP(O26,Fornecedores!$A$2:$B$17,2,FALSE)","v":500615250},32,"TERGLASS","0828050/33191",460,"CBM",{"$f":"VLOOKUP(U26,Fornecedores!$A$2:$B$17,2,FALSE)","v":"B85631083"},33,"MB","D9392246",720.3]
["Oculo Traseiro",null,null,"002132215",null,null,"CBM",{"$f":"VLOOKUP(G27,Fornecedores!$A$2:$B$17,2,FALSE)","v":"B85631083"},31,"IRIZAR","D9405873",646,"2025-01-20","2026-01-20","NASACAR",{"$f":"VLOOKUP(O27,Fornecedores!$A$2:$B$17,2,FALSE)","v":500615250},32,"VIDUR","0820639/22630",898]
["Vidro divisoria interior",null,"002163178",null,null,null,"CBM",{"$f":"VLOOKUP(G28,Fornecedores!$A$2:$B$17,2,FALSE)","v":"B85631083"},31,"MERCEDES","A3947111710",490,"2025-01-20","2026-01-20"]
["Vidro janela motorista",null,"002163061",null,null,null,"CBM",{"$f":"VLOOKUP(G29,Fornecedores!$A$2:$B$17,2,FALSE)","v":"B85631083"},31,"MERCEDES","A3116708411",1690,"2025-01-20","2026-01-20"]
["Vidro janela motorista","002153740",null,null,null,null,"CBM",{"$f":"VLOOKUP(G30,Fornecedores!$A$2:$B$17,2,FALSE)","v":"B85631083"},31,"CBM PART","D9413599",554,"2025-01-20","2026-01-20"]
{"$rows_left_out":8}
{"sheet":"Fornecedores","index":4,"n_rows":17,"n_cols":12,"rows_kept":17,"cut":false,"hidden":false,"merged":[[0,2,0,3],[0,4,0,5],[0,6,0,7],[0,8,0,9],[0,10,0,11]]}
["Nome","NIF","BT",null,"RL",null,"Universo Algarve",null,"Universo Alentejo",null,"Universo Tejo"]
["NASACAR",500615250,22511,20082,22511," 06657 ",22511," 00991",2254," 04483",22511," 21677"]
["NORS",500662860,22511,49365,22511,10004,22511," 39064",2254," 04516",22511," 22998"]
["COPEROL",502021160,22511,15456,22511," 10000",22511," 00293 ",2254," 01504",22511,"20438 "]
["KRAULTI",502271450,22511,20213,22511,"08024",22511,"0017",2254,"03627",22511,21655]
["GLOBAL P",509436722,22511,49333,22511," 09997",22511," 01635",22511,49333,22511,49333]
["MOTORBUS",503500992,22511,16366,22511,8679,22511," 01499",2254," 04363",22511," 22040"]
["TECNIAMPER",501948775,22511,14471,22511,"07215 ",22511," 01371",2254,"06210 ",22511," 22155"]
["CBM","B85631083",22512,30052,22511,"09403 ",22512,"09403",22512,"09403",22512," 30371"]
["EUROPART",503791970,22511,16559,22511," 08718",22511,386,2254," 02112",22511," 20639"]
["EXPRESSGLASS",506749495,22511,17910,22511,"02143",22511,"02143",2254,"02143",22511,"02143"]
["CARBUS",503801461,22511,15202,22511," 08654",22511," 03807 ",2254," 01030",22511," 20460"]
["IM",500952981,22511,15049,22511,"08251 ",22511,"00526",2254," 03122",22511," 21114"]
["AGT",501276343,22511,14691,22511," 09870",22511," 03145",2254," 00298",22511," 20120"]
["ATLASBUS","B27739879",22512,48746,22512," 08782",22512,48746,2255," 00102",25112,48746]
["HYDRAPLAN",507448979,22511,30131,22511,"08935",22511,"00466",2254,"02920",22511,21102]
["DAIMLER TR",516853252,22511,49398,22511,10011,22511,"00348",2254,"01468",22511,24153]

{"sheet":"Input","index":5,"n_rows":8,"n_cols":8,"rows_kept":8,"cut":false,"hidden":false,"merged":[]}
[]
[null,"Nome Concurso","CP10.2024","Parabrisas"]
[null,"Base Cod. Fornecedores","BT","RL","Universo Algarve","Universo Alentejo","Universo Tejo","Universo Tejo"]
[null,"Empresas","BT","RL","EVA","RA","RT","ROeste"]
[null,"Cod. Empresas",10,16,9,8,4,84]
[null,"Nº Empresas AS400",5,"começa na col","B",{"$f":"COLUMN(INDIRECT(E6&\"1\"))","v":2}]
[null,"Ref. Peças AS400","BT","RL","EVA","RA","TEJO","TEJO"]
[null,"Dimensão Propostas",6,"colunas"]